program: Orca
programVersion: 4.2.1
elementType: Cl Cl Cl S N N N N C C C C C C C C C C C C C C C C C H H H H H H H H H H H H H
charge: 0
multiplicity: 1
keywords: wb97x-d3
keywords: def2-TZVPP
keywords: def2/J RIJCOSX GRIDX6 NOFINALGRIDX
keywords: grid4 nofinalgrid
keywords: scfconv7
keywords: smallprint printgap noloewdin
keywords: NOSOSCF
formula: C17H13Cl3N4S
InChI: InChI=1/C17H13Cl3N4S/c18-13-3-1-12(2-4-13)9-25-17(8-24-11-21-10-22-24)23-16-6-5-14(19)7-15(16)20/h1-7,10-11H,8-9H2
38 atoms
Cl -0.296137 -1.314019 1.198965
Cl -4.742048 -2.225075 1.002795
Cl 2.89749 -4.797154 -1.350463
S  -0.263671 2.928267 -0.168182
N  2.336738 2.740712 1.129262
N  0.427232 0.553127 -1.033658
N  1.90699 3.384191 2.218135
N  3.36543 4.646861 1.082589
C  1.844826 1.436307 0.78044
C  -1.657778 2.428728 -1.22384
C  0.712945 1.476794 -0.224051
C  -2.439153 1.27423 -0.669455
C  -2.589696 0.106015 -1.407528
C  -3.0250 1.347573 0.58981
C  1.062586 -0.678765 -1.05312
C  -3.303298 -0.971198 -0.906528
C  -3.738127 0.279348 1.109347
C  3.204072 3.508251 0.459223
C  0.783357 -1.666064 -0.103798
C  1.920681 -1.008175 -2.101649
C  -3.866808 -0.875867 0.354395
C  1.341951 -2.931316 -0.187347
C  2.494848 -2.262754 -2.196372
C  2.198385 -3.217537 -1.236498
C  2.550264 4.519987 2.150136
H  1.497436 0.952613 1.694251
H  2.666328 0.838498 0.385125
H  -1.290119 2.21974 -2.227232
H  -2.270542 3.330422 -1.283956
H  -2.135099 0.02652 -2.386384
H  -2.918955 2.245575 1.186718
H  -3.403711 -1.876521 -1.490063
H  -4.185324 0.348979 2.091815
H  3.68324 3.195587 -0.455626
H  2.132548 -0.262527 -2.856652
H  1.109172 -3.678787 0.558547
H  3.162169 -2.491867 -3.015879
H  2.43249 5.286599 2.899932
elementType: Cl S N C H
totalener: -2653.54181414 hartree
nucrepener: 2750.38683573 hartree
electener: -5403.92864987 hartree
oneelecener: -9116.35507897 hartree
twoeener: 3712.42642910 hartree
cpcmener: -0.02762739 hartree
kineticenergy: 2647.22288122 hartree
xcener: -168.234345365756 hartree
chargesum: -0.0000000
charge: -0.082155 -0.105994 -0.091771 -0.075469 0.060922 -0.278590 -0.337437 -0.402178 -0.047083 -0.038661 0.139084 0.092832 -0.204083 -0.232483 0.152262 -0.135108 -0.128458 0.082033 -0.024409 -0.247839 0.079980 -0.080826 -0.089065 0.058454 0.074418 0.135088 0.154043 0.118227 0.151431 0.128975 0.131927 0.140547 0.142817 0.178858 0.143434 0.127792 0.145128 0.163359
qa: -0.0822 -0.1060 -0.0918 -0.0755 0.0609 -0.2786 -0.3374 -0.4022 -0.0471 -0.0387 0.1391 0.0928 -0.2041 -0.2325 0.1523 -0.1351 -0.1285 0.0820 -0.0244 -0.2478 0.0800 -0.0808 -0.0891 0.0585 0.0744 0.1351 0.1540 0.1182 0.1514 0.1290 0.1319 0.1405 0.1428 0.1789 0.1434 0.1278 0.1451 0.1634
va: 1.2436 1.1981 1.2111 2.4061 3.3756 2.9470 2.8557 3.0282 3.8576 3.8248 3.9738 3.5067 3.9536 4.0316 3.6683 3.9463 3.9535 4.0487 3.9811 4.0328 3.8168 3.9982 3.9526 3.8659 4.0343 1.0139 0.9914 1.0320 0.9991 1.0143 1.0139 1.0046 1.0042 0.9903 1.0132 1.0184 1.0030 0.9937
dispcorr: -0.023637003 hartree
energy: -2653.565451138400
dipole: 3.40282 -2.85628 0.54654 20.66697 -20.51073 0.15624 -5.65521 4.25545 -1.39976
magnitude: 1.51078 au
magnitude: 3.84010 debye
