program: Orca
programVersion: 4.2.1
elementType: Cl Cl Cl S N N N N C C C C C C C C C C C C C C C C C H H H H H H H H H H H H H
charge: 0
multiplicity: 1
keywords: wb97x-d3
keywords: def2-TZVPP
keywords: def2/J RIJCOSX GRIDX6 NOFINALGRIDX
keywords: grid4 nofinalgrid
keywords: scfconv7
keywords: smallprint printgap noloewdin
keywords: NOSOSCF
formula: C17H13Cl3N4S
InChI: InChI=1/C17H13Cl3N4S/c18-13-3-1-12(2-4-13)9-25-17(8-24-11-21-10-22-24)23-16-6-5-14(19)7-15(16)20/h1-7,10-11H,8-9H2
38 atoms
Cl -0.479837 -0.591437 1.403429
Cl -4.228346 -2.947483 0.703828
Cl 3.544235 -3.580245 -0.500768
S  -1.363323 3.285913 -0.365926
N  2.20601 2.151004 0.912523
N  0.117465 1.201769 -0.929845
N  2.695359 1.17227 1.676767
N  4.25772 1.916696 0.257238
C  0.842553 2.589712 1.02347
C  -2.426471 2.34333 -1.502538
C  -0.01749 2.185017 -0.155783
C  -2.882985 1.026717 -0.949401
C  -2.539783 -0.159958 -1.586767
C  -3.658345 0.964669 0.203892
C  0.978797 0.130709 -0.760023
C  -2.95461 -1.385804 -1.090855
C  -4.079124 -0.251675 0.716232
C  3.148952 2.585404 0.069013
C  0.775643 -0.823239 0.241974
C  1.992569 -0.10778 -1.686557
C  -3.718168 -1.419787 0.063032
C  1.554196 -1.96486 0.324699
C  2.793722 -1.231777 -1.606581
C  2.564336 -2.157043 -0.600944
C  3.925787 1.063776 1.249493
H  0.824227 3.675548 1.13419
H  0.42217 2.172144 1.938527
H  -1.906792 2.220748 -2.451591
H  -3.270569 3.013708 -1.677391
H  -1.931766 -0.133152 -2.481549
H  -3.936285 1.875498 0.72066
H  -2.672453 -2.300369 -1.594793
H  -4.680977 -0.286388 1.614358
H  2.982856 3.375389 -0.647318
H  2.152222 0.607132 -2.483061
H  1.374497 -2.688484 1.107912
H  3.580857 -1.386803 -2.331742
H  4.614436 0.348858 1.671545
elementType: Cl S N C H
totalener: -2653.53889383 hartree
nucrepener: 2852.26469592 hartree
electener: -5505.80358974 hartree
oneelecener: -9320.88784045 hartree
twoeener: 3815.08425070 hartree
cpcmener: -0.02702017 hartree
kineticenergy: 2647.22838273 hartree
xcener: -168.239485137839 hartree
chargesum: -0.0000000
charge: -0.086548 -0.105245 -0.096824 -0.074084 0.123628 -0.266331 -0.335683 -0.396473 -0.091727 -0.056759 0.126745 0.083401 -0.196670 -0.230000 0.181914 -0.132721 -0.125038 0.053520 0.018485 -0.279880 0.081338 -0.104717 -0.078700 0.064550 0.074611 0.147953 0.145195 0.120069 0.152807 0.130072 0.131827 0.139743 0.141484 0.177396 0.139916 0.122428 0.142189 0.158129
qa: -0.0865 -0.1052 -0.0968 -0.0741 0.1236 -0.2663 -0.3357 -0.3965 -0.0917 -0.0568 0.1267 0.0834 -0.1967 -0.2300 0.1819 -0.1327 -0.1250 0.0535 0.0185 -0.2799 0.0813 -0.1047 -0.0787 0.0645 0.0746 0.1480 0.1452 0.1201 0.1528 0.1301 0.1318 0.1397 0.1415 0.1774 0.1399 0.1224 0.1422 0.1581
va: 1.2418 1.1990 1.2064 2.4015 3.3387 2.9543 2.8650 3.0194 3.8652 3.8317 4.0141 3.5044 3.9507 4.0263 3.6812 3.9382 3.9469 4.0605 3.8996 3.9918 3.8171 4.0296 3.9394 3.8542 4.0201 1.0027 1.0159 1.0295 0.9986 1.0135 1.0136 1.0052 1.0046 0.9926 1.0158 1.0210 1.0030 0.9972
dispcorr: -0.027382050 hartree
energy: -2653.566275875157
dipole: -0.60479 -0.39749 -1.00229 19.45095 -17.07990 2.37106 -7.15576 6.33132 -0.82444
magnitude: 2.70300 au
magnitude: 6.87047 debye
