program: Orca
programVersion: 4.2.1
elementType: Cl Cl Cl S N N N N C C C C C C C C C C C C C C C C C H H H H H H H H H H H H H
charge: 0
multiplicity: 1
keywords: wb97x-d3
keywords: def2-TZVPP
keywords: def2/J RIJCOSX GRIDX6 NOFINALGRIDX
keywords: grid4 nofinalgrid
keywords: scfconv7
keywords: smallprint printgap noloewdin
keywords: NOSOSCF
formula: C17H13Cl3N4S
InChI: InChI=1/C17H13Cl3N4S/c18-13-3-1-12(2-4-13)9-25-17(8-24-11-21-10-22-24)23-16-6-5-14(19)7-15(16)20/h1-7,10-11H,8-9H2
38 atoms
Cl 0.089636 -0.581298 -1.375065
Cl -4.223926 -1.143947 -2.64848
Cl 3.058359 -4.942232 -0.361906
S  -0.343512 2.445028 1.851495
N  2.002054 2.812654 0.149825
N  0.324277 -0.074312 1.558417
N  2.280699 3.93766 0.813743
N  1.655826 4.396757 -1.286525
C  2.033476 1.532915 0.801108
C  -1.89302 1.55883 2.189567
C  0.693766 1.117894 1.375743
C  -2.474887 0.890543 0.979096
C  -2.776269 1.619523 -0.16698
C  -2.731296 -0.475222 0.985697
C  1.030129 -1.173419 1.09029
C  -3.315673 1.003159 -1.284314
C  -3.2774 -1.108113 -0.120267
C  1.622828 3.101313 -1.098817
C  0.965809 -1.560026 -0.251644
C  1.740679 -1.989893 1.96893
C  -3.559056 -0.361229 -1.250847
C  1.58416 -2.714215 -0.70537
C  2.370439 -3.142021 1.532771
C  2.28515 -3.497467 0.195717
C  2.061146 4.860323 -0.086282
H  2.761735 1.580786 1.612014
H  2.392261 0.784249 0.096267
H  -2.5566 2.340946 2.564806
H  -1.735493 0.851128 3.002313
H  -2.582341 2.684954 -0.201097
H  -2.495818 -1.06253 1.863774
H  -3.542217 1.582623 -2.16912
H  -3.466814 -2.172925 -0.098814
H  1.34853 2.34848 -1.821957
H  1.791061 -1.7154 3.014395
H  1.517979 -2.992278 -1.748223
H  2.918811 -3.755543 2.234556
H  2.205884 5.908173 0.126662
elementType: Cl S N C H
totalener: -2653.54171379 hartree
nucrepener: 2781.03488699 hartree
electener: -5434.57660078 hartree
oneelecener: -9177.52029330 hartree
twoeener: 3742.94369252 hartree
cpcmener: -0.02626907 hartree
kineticenergy: 2647.21107323 hartree
xcener: -168.232854498989 hartree
chargesum: 0.0000000
charge: -0.085088 -0.105597 -0.091851 -0.066662 0.084240 -0.284287 -0.336000 -0.403713 -0.092932 -0.044202 0.163857 0.101792 -0.238977 -0.205586 0.172916 -0.122310 -0.133326 0.086462 -0.049639 -0.241012 0.076932 -0.080026 -0.092737 0.056082 0.071833 0.151324 0.156951 0.152183 0.116434 0.129529 0.127344 0.142481 0.140439 0.159305 0.145621 0.129254 0.145332 0.163635
qa: -0.0851 -0.1056 -0.0919 -0.0667 0.0842 -0.2843 -0.3360 -0.4037 -0.0929 -0.0442 0.1639 0.1018 -0.2390 -0.2056 0.1729 -0.1223 -0.1333 0.0865 -0.0496 -0.2410 0.0769 -0.0800 -0.0927 0.0561 0.0718 0.1513 0.1570 0.1522 0.1164 0.1295 0.1273 0.1425 0.1404 0.1593 0.1456 0.1293 0.1453 0.1636
va: 1.2418 1.1985 1.2110 2.4122 3.3408 2.9611 2.8576 3.0321 3.8619 3.8260 3.9556 3.4879 4.0271 3.9522 3.6760 3.9465 3.9427 4.0518 3.9608 4.0367 3.8161 3.9917 3.9563 3.8727 4.0355 1.0079 0.9882 0.9983 1.0333 1.0163 1.0143 1.0039 1.0048 1.0098 1.0101 1.0178 1.0028 0.9937
dispcorr: -0.024410452 hartree
energy: -2653.566124243378
dipole: 0.26577 0.14934 0.41511 14.93758 -15.49431 -0.55674 13.71860 -12.13424 1.58436
magnitude: 1.72988 au
magnitude: 4.39700 debye
