program: Orca
programVersion: 4.2.1
elementType: Cl Cl Cl S N N N N C C C C C C C C C C C C C C C C C H H H H H H H H H H H H H
charge: 0
multiplicity: 1
keywords: wb97x-d3
keywords: def2-TZVPP
keywords: def2/J RIJCOSX GRIDX6 NOFINALGRIDX
keywords: grid4 nofinalgrid
keywords: scfconv7
keywords: smallprint printgap noloewdin
keywords: NOSOSCF
formula: C17H13Cl3N4S
InChI: InChI=1/C17H13Cl3N4S/c18-13-3-1-12(2-4-13)9-25-17(8-24-11-21-10-22-24)23-16-6-5-14(19)7-15(16)20/h1-7,10-11H,8-9H2
38 atoms
Cl 0.815913 -1.244004 3.960823
Cl -2.525786 -0.704934 -4.14438
Cl 3.149106 -4.639043 0.511952
S  -0.956838 2.673205 1.559009
N  1.35907 2.517594 -0.562647
N  -0.003608 0.230316 1.567002
N  1.05634 1.709052 -1.580354
N  0.978339 3.846805 -2.231683
C  1.562851 1.990508 0.762162
C  -2.474421 1.681911 1.366924
C  0.264304 1.432512 1.30794
C  -2.549993 1.079734 -0.00286
C  -2.493696 -0.297541 -0.178273
C  -2.622166 1.895368 -1.129031
C  0.815555 -0.852912 1.29457
C  -2.494349 -0.85684 -1.448544
C  -2.626393 1.355186 -2.402608
C  1.29599 3.791322 -0.962425
C  1.220507 -1.684143 2.341672
C  1.149561 -1.229385 -0.006185
C  -2.552012 -0.021707 -2.55046
C  1.943592 -2.841518 2.11408
C  1.865991 -2.388238 -0.253255
C  2.258111 -3.185664 0.809098
C  0.84161 2.545588 -2.561162
H  1.914252 2.802336 1.400479
H  2.341647 1.229591 0.742275
H  -3.284021 2.391361 1.546596
H  -2.513278 0.926832 2.149862
H  -2.43923 -0.949012 0.684107
H  -2.657373 2.972132 -1.015839
H  -2.439171 -1.930182 -1.570474
H  -2.675757 2.001532 -3.268395
H  1.492393 4.626054 -0.307984
H  0.8358 -0.602315 -0.830605
H  2.251455 -3.464614 2.94249
H  2.11215 -2.662325 -1.270022
H  0.575555 2.207828 -3.550368
elementType: Cl S N C H
totalener: -2653.54046862 hartree
nucrepener: 2782.99349952 hartree
electener: -5436.53396815 hartree
oneelecener: -9181.79146207 hartree
twoeener: 3745.25749392 hartree
cpcmener: -0.02464794 hartree
kineticenergy: 2647.22227725 hartree
xcener: -168.232964079118 hartree
chargesum: -0.0000000
charge: -0.077692 -0.105498 -0.092947 -0.096220 0.134516 -0.280799 -0.346852 -0.402037 -0.114483 -0.049513 0.173870 0.068468 -0.193763 -0.223977 0.231514 -0.140299 -0.136436 0.066344 -0.095967 -0.248393 0.101382 -0.072242 -0.108085 0.055052 0.083349 0.148711 0.147731 0.150706 0.117392 0.137820 0.127519 0.139406 0.141883 0.177480 0.165860 0.123818 0.143416 0.148965
qa: -0.0777 -0.1055 -0.0929 -0.0962 0.1345 -0.2808 -0.3469 -0.4020 -0.1145 -0.0495 0.1739 0.0685 -0.1938 -0.2240 0.2315 -0.1403 -0.1364 0.0663 -0.0960 -0.2484 0.1014 -0.0722 -0.1081 0.0551 0.0833 0.1487 0.1477 0.1507 0.1174 0.1378 0.1275 0.1394 0.1419 0.1775 0.1659 0.1238 0.1434 0.1490
va: 1.2495 1.2012 1.2102 2.3416 3.3043 2.9334 2.8396 3.0263 3.9386 3.8302 3.9223 3.5430 3.9508 3.9794 3.5910 3.9467 3.9219 4.0491 3.9969 3.9620 3.8135 3.9691 4.0098 3.8593 4.0328 1.0011 0.9949 0.9988 1.0342 1.0110 1.0177 1.0063 1.0037 0.9926 1.0238 1.0211 1.0055 0.9998
dispcorr: -0.025656840 hartree
energy: -2653.566125462551
dipole: -6.25469 6.39795 0.14326 17.62942 -16.49115 1.13826 -2.74243 4.00928 1.26685
magnitude: 1.70911 au
magnitude: 4.34422 debye
