program: Gaussian 09
title: 000063463
version: EM64L-G09RevD.01
frameworkgroup: C1[X(C20H15N3O)]
method: RPBEPBE
basis: SDD
operation: Freq
keyword: #p
keyword: freq=noraman
keyword: PBEPBE/SDD
title: #p freq=noraman PBEPBE/SDD
converged: YES YES NO NO
title: Mulliken charges:
elementType: O N N N C C C C C C C C C C C C C C C C C C C C H H H H H H H H H H H H H H H
charge: -0.237241 -0.353874 -0.032695 0.001679 0.319825 0.005367 0.152627 0.122812 0.054082 0.336371 0.290231 -0.332428 -0.323281 -0.392435 -0.349574 -0.831593 -0.233160 -0.232750 -0.243725 -0.205337 -0.250783 -0.443548 -0.199716 -0.329734 0.256077 0.272605 0.235894 0.264564 0.288062 0.224170 0.219787 0.234012 0.230088 0.235495 0.235665 0.260046 0.273627 0.234005 0.244780
chargesum: 0.00000
title: Mulliken charges with hydrogens summed into heavy atoms:
elementType: O N N N C C C C C C C C C C C C C C C C C C C C
charge: -0.237241 -0.353874 -0.032695 0.001679 0.319825 0.005367 0.152627 0.122812 0.054082 0.336371 0.290231 -0.076350 -0.050675 -0.156542 -0.085010 -0.099574 0.000852 -0.002662 -0.008230 0.030328 0.009263 -0.169920 0.034290 -0.084953
polarizability: 3.52298852e+02 -2.14987645e+00 2.43039423e+02 2.22215867e+00 -1.56767949e+01 1.49499687e+02
1716.lowfreq: -5.0415 -0.0005 -0.0004 0.0005 3.2014 7.7966 32.4701 38.2248 56.1240
frequency: 32.3724 38.2005 56.1107 59.4658 72.2274 91.4241 129.3512 145.8642 161.1186 180.2274 196.0865 214.7909 258.3488 270.0233 293.4922 312.0752 346.8375 349.9359 391.1461 419.0561 446.2798 458.5885 485.3857 509.1578 519.0029 535.2128 548.6120 569.2843 582.2169 612.5067 642.8910 672.7100 683.1042 686.6187 700.9625 716.0366 720.6522 760.3098 783.6482 786.4109 796.0370 813.4672 819.3688 864.9390 873.9357 898.2432 911.7766 923.7474 945.3337 949.9547 981.5297 984.3138 988.0673 991.4133 1003.4643 1003.9191 1013.3268 1026.4928 1040.2687 1045.7311 1053.6777 1099.0070 1108.1603 1120.6924 1128.6028 1167.3020 1175.3364 1197.0358 1203.5590 1214.8270 1239.6749 1257.2493 1280.2998 1285.1294 1304.8611 1322.6922 1332.9755 1375.6174 1392.3947 1397.5297 1406.4944 1433.0683 1445.6408 1458.0257 1461.6040 1462.1067 1480.7871 1486.5655 1523.1030 1554.2488 1563.7017 1581.7443 1590.3809 1609.6205 1612.9205 1620.6244 2979.2380 3060.0530 3089.0047 3126.2607 3134.8061 3136.6882 3138.1176 3149.4690 3150.9851 3153.5570 3158.6787 3165.4726 3168.6092 3175.0956 3179.2709
redmass: 5.4032 5.3185 5.1463 4.1608 4.7543 4.9308 3.8067 1.3945 3.6107 2.8648 4.3804 5.2624 5.9069 4.9594 4.4865 5.3663 5.5231 4.2753 3.1473 3.6240 4.4208 2.9625 4.7976 8.4114 4.2884 4.5815 4.6731 7.7505 7.2088 7.5784 6.1915 6.3771 5.0771 6.1737 6.1663 1.8221 2.9422 1.5217 1.5536 3.6779 3.3348 1.9356 5.1429 2.5059 1.8729 1.4920 5.9675 1.4379 1.5222 1.3924 1.3727 1.4115 1.6081 1.3294 3.9061 1.3370 3.2496 3.3542 2.4697 1.5654 2.4569 2.2713 2.4430 1.6479 1.9235 1.1316 1.0570 2.3912 1.3359 2.3920 3.2816 2.4695 2.8458 1.4867 6.7243 3.0256 1.2937 8.7888 7.2067 1.2556 2.2798 2.1408 2.3027 2.6795 2.2027 1.1764 1.6884 1.4955 8.1541 6.0618 7.0234 5.8712 6.5269 8.4626 6.8970 8.1212 1.0371 1.0969 1.0994 1.0867 1.0884 1.0862 1.0887 1.0947 1.0901 1.0922 1.0926 1.0956 1.1009 1.0999 1.0986
irintensity: 0.6148 1.8003 1.6486 0.1233 0.4211 0.9042 2.4024 0.4380 2.0023 1.4041 0.2301 0.7198 1.2613 4.1279 1.8172 1.0125 1.6226 1.2975 1.7094 0.6024 1.2079 8.6127 0.8449 1.9192 4.0980 4.3508 1.4197 0.4135 3.5416 1.7168 16.8619 1.8825 10.1043 5.5530 5.5012 40.9902 14.9130 54.2124 82.5440 4.0334 1.1674 28.5582 0.7970 2.8285 2.1643 0.7977 13.0764 3.9776 4.8346 0.9312 2.7153 0.8276 1.3157 0.0371 11.4041 0.1122 17.0231 2.3431 10.0197 9.9515 6.4402 4.3486 43.3901 16.6138 9.3031 2.5215 0.9094 11.7827 7.3680 15.5412 23.5773 22.5199 29.3670 0.3758 26.8472 64.1330 11.9787 4.1201 45.8349 19.8091 26.9860 1.6922 3.8215 53.0878 49.5551 14.1851 20.5461 54.3749 209.2047 28.2862 1.8771 18.1402 3.0765 214.8868 17.1637 64.8703 20.0212 12.5674 22.0262 5.6045 11.1778 4.1663 3.7242 25.1125 7.9930 9.6309 15.9076 10.8944 21.5864 24.7380 12.0046
temp: 298.150 k
press: 1.00000 atm
elementType: 8 7 7 7 6 6 6 6 6 6 6 6 6 6 6 6 6 6 6 6 6 6 6 6 1 1 1 1 1 1 1 1 1 1 1 1 1 1 1
symmnumber: 1
zpe: 784903.6 jmol-1
zpe.correction: 0.298954 hartree
zpe.thermalcorrener: 0.317954 hartree
zpe.thermalcorrenthalpy: 0.318898 hartree
zpe.thermalcorrgfe: 0.250925 hartree
zpe.sumelectzpe: -1008.994439 hartree
zpe.sumelectthermal: -1008.975440 hartree
zpe.sumelectthermalent: -1008.974496 hartree
zpe.sumelectthermalfe: -1009.042469 hartree
dipole: 0.9764 -1.1444 1.4510
dipole: 2.0901
quadrupole: -110.4803 -153.9441 -134.2396
quadrupole: -10.0714 4.2380 -0.6768
quadrupole: 22.4077 -21.0561 -1.3516 -10.0714 4.2380 -0.6768
hfenergy: -1009.2933934 hartree
pointgroup: C01 [X(C20H15N3O1)]
dipole: -0.3567407 0.3605652 0.6472348 debye
polarizability: 351.7859787|-1.3791106|236.1866346|-10.0184999|29.1089243|156.8653487 unknown
InChI: InChI=1S/C20H15N3O/c1-14-7-2-5-11-18(14)23-19(15-8-6-12-21-13-15)22-17-10-4-3-9-16(17)20(23)24/h2-13H,1H3
charge 0 multiplicity 1
39 atoms
O  1.400945 2.532719 0.265912
N  0.201989 0.512079 0.083051
N  1.331361 -1.605288 -0.208726
N  -2.290799 -3.595472 -0.922049
C  -1.039482 1.281595 0.005437
C  0.21643 -0.901504 -0.051314
C  2.657786 0.474924 -0.006924
C  1.42972 1.275807 0.136002
C  2.564785 -0.938422 -0.207512
C  -1.513251 2.006559 1.131943
C  -1.058684 -1.67436 -0.010176
C  -1.725059 1.303046 -1.22932
C  3.926352 1.110811 0.016448
C  -2.714785 2.742266 0.972703
C  3.754966 -1.697456 -0.387506
C  -0.771497 2.014404 2.452456
C  -2.919601 2.040531 -1.362107
C  -3.415095 2.764009 -0.253792
C  5.093887 0.349992 -0.160157
C  5.004457 -1.057098 -0.364635
C  -2.105522 -1.43396 0.915904
C  -1.203654 -2.775472 -0.899742
C  -3.2335 -2.280521 0.910002
C  -3.289131 -3.340601 -0.022915
H  -1.318008 0.744388 -2.07885
H  3.961007 2.194626 0.166873
H  -3.100299 3.309734 1.827872
H  3.66051 -2.777351 -0.53503
H  0.115703 2.669389 2.377484
H  -1.413734 2.388186 3.267664
H  -0.404148 1.009224 2.732449
H  -3.451127 2.054027 -2.31918
H  -4.339962 3.344167 -0.344393
H  6.074494 0.836964 -0.142302
H  5.919058 -1.644134 -0.502372
H  -2.039817 -0.616229 1.638145
H  -0.402243 -3.004196 -1.609324
H  -4.053509 -2.125783 1.61765
H  -4.149046 -4.019002 -0.058271
