program: Orca
programVersion: 4.2.1
elementType: Cl Cl Cl S N N N N C C C C C C C C C C C C C C C C C H H H H H H H H H H H H H
charge: 0
multiplicity: 1
keywords: wb97x-d3
keywords: def2-TZVPP
keywords: def2/J RIJCOSX GRIDX6 NOFINALGRIDX
keywords: grid4 nofinalgrid
keywords: scfconv7
keywords: smallprint printgap noloewdin
keywords: NOSOSCF
formula: C17H13Cl3N4S
InChI: InChI=1/C17H13Cl3N4S/c18-13-3-1-12(2-4-13)9-25-17(8-24-11-21-10-22-24)23-16-6-5-14(19)7-15(16)20/h1-7,10-11H,8-9H2
38 atoms
Cl 0.18518 -1.874773 0.163626
Cl -5.777165 -1.391678 2.159441
Cl 5.428322 -2.477805 -0.812541
S  -1.199112 2.688967 -1.16703
N  1.787453 1.799635 0.976438
N  0.438379 0.627392 -1.367281
N  0.936021 1.194366 1.806613
N  3.051063 0.729673 2.370869
C  1.296043 2.598447 -0.114055
C  -2.301302 1.431794 -1.860747
C  0.289553 1.801638 -0.929125
C  -3.148647 0.743167 -0.826158
C  -2.654398 0.379263 0.423389
C  -4.468923 0.43015 -1.135021
C  1.6299 -0.073559 -1.22966
C  -3.456397 -0.279272 1.341874
C  -5.283998 -0.230549 -0.227807
C  3.046294 1.512271 1.321103
C  1.644491 -1.288133 -0.541229
C  2.815341 0.350333 -1.828024
C  -4.767933 -0.579165 1.008919
C  2.805803 -2.028502 -0.403728
C  3.984614 -0.379747 -1.709086
C  3.972333 -1.56066 -0.985367
C  1.736735 0.562547 2.625101
H  2.139166 2.908866 -0.730087
H  0.839443 3.508128 0.278363
H  -1.681519 0.717468 -2.405822
H  -2.92679 1.942653 -2.592337
H  -1.635962 0.612284 0.707652
H  -4.878706 0.707513 -2.098715
H  -3.058841 -0.550011 2.310757
H  -6.309388 -0.46005 -0.484411
H  3.90528 1.889689 0.788801
H  2.819713 1.264121 -2.408604
H  2.796237 -2.958055 0.148634
H  4.893132 -0.024706 -2.175703
H  1.362681 -0.042397 3.436126
elementType: Cl S N C H
totalener: -2653.53971784 hartree
nucrepener: 2757.38046812 hartree
electener: -5410.92018596 hartree
oneelecener: -9131.12079734 hartree
twoeener: 3720.20061138 hartree
cpcmener: -0.02935634 hartree
kineticenergy: 2647.21322687 hartree
xcener: -168.236078801737 hartree
chargesum: 0.0000000
charge: -0.080253 -0.101812 -0.091153 -0.059744 0.139071 -0.305619 -0.351739 -0.392104 -0.084577 0.003005 0.148699 -0.052451 -0.143401 -0.177688 0.210475 -0.164213 -0.149139 0.064787 -0.016178 -0.266240 0.109048 -0.109311 -0.105479 0.074278 0.069303 0.145582 0.125348 0.127643 0.134540 0.133514 0.138565 0.133558 0.143010 0.174557 0.151073 0.123564 0.146452 0.155029
qa: -0.0803 -0.1018 -0.0912 -0.0597 0.1391 -0.3056 -0.3517 -0.3921 -0.0846 0.0030 0.1487 -0.0525 -0.1434 -0.1777 0.2105 -0.1642 -0.1491 0.0648 -0.0162 -0.2662 0.1090 -0.1093 -0.1055 0.0743 0.0693 0.1456 0.1253 0.1276 0.1345 0.1335 0.1386 0.1336 0.1430 0.1746 0.1511 0.1236 0.1465 0.1550
va: 1.2365 1.2034 1.2121 2.4139 3.2799 2.9736 2.8143 3.0202 3.9291 3.7643 3.9757 3.7541 3.8707 3.9696 3.6902 4.0526 3.9733 4.0369 3.9298 3.9999 3.8183 4.0302 3.9453 3.8564 4.0364 0.9928 1.0130 1.0367 1.0071 1.0045 1.0013 1.0135 1.0053 0.9918 0.9998 1.0203 1.0021 0.9978
dispcorr: -0.025173297 hartree
energy: -2653.564891135378
dipole: -1.47193 2.08101 0.60909 16.70600 -14.44110 2.26490 -6.93495 4.89016 -2.04479
magnitude: 3.11158 au
magnitude: 7.90901 debye
