program: Orca
programVersion: 4.2.1
elementType: Cl Cl Cl S N N N N C C C C C C C C C C C C C C C C C H H H H H H H H H H H H H
charge: 0
multiplicity: 1
keywords: wb97x-d3
keywords: def2-TZVPP
keywords: def2/J RIJCOSX GRIDX6 NOFINALGRIDX
keywords: grid4 nofinalgrid
keywords: scfconv7
keywords: smallprint printgap noloewdin
keywords: NOSOSCF
formula: C17H13Cl3N4S
InChI: InChI=1/C17H13Cl3N4S/c18-13-3-1-12(2-4-13)9-25-17(8-24-11-21-10-22-24)23-16-6-5-14(19)7-15(16)20/h1-7,10-11H,8-9H2
38 atoms
Cl 2.357782 -0.655053 2.56112
Cl -5.008564 -1.08157 -3.059301
Cl 3.096032 -4.836976 -0.722502
S  -0.675361 2.497676 0.993063
N  2.133748 2.847017 0.247074
N  0.024947 -0.025442 0.777988
N  1.903193 3.983234 -0.419862
N  3.081181 4.389298 1.444639
C  1.61054 1.591416 -0.21048
C  -2.156112 1.579764 1.511874
C  0.361547 1.165675 0.535255
C  -2.864249 0.913852 0.369356
C  -3.375596 1.665357 -0.683783
C  -3.029226 -0.465337 0.342258
C  0.794939 -1.120111 0.406111
C  -4.036753 1.060878 -1.738934
C  -3.691924 -1.08641 -0.705643
C  2.835091 3.109836 1.362379
C  1.881998 -1.555629 1.164707
C  0.435317 -1.8750 -0.708786
C  -4.190389 -0.317237 -1.743508
C  2.591753 -2.696076 0.826785
C  1.137091 -3.01188 -1.064261
C  2.214947 -3.417272 -0.29266
C  2.489907 4.879154 0.33314
H  2.377787 0.821698 -0.130938
H  1.365762 1.70522 -1.267287
H  -2.786812 2.339532 1.977859
H  -1.875616 0.863966 2.283335
H  -3.246286 2.740874 -0.691097
H  -2.626283 -1.068421 1.144873
H  -4.429662 1.65497 -2.552125
H  -3.815616 -2.160471 -0.714298
H  3.134566 2.345617 2.063532
H  -0.420158 -1.559044 -1.291699
H  3.430307 -3.012354 1.430675
H  0.844755 -3.580862 -1.935324
H  2.496841 5.925169 0.071035
totalener: -2653.51236515 hartree
nucrepener: 2686.71812481 hartree
electener: -5340.23048996 hartree
oneelecener: -8988.40572417 hartree
twoeener: 3648.17523421 hartree
kineticenergy: 2647.23314311 hartree
xcener: -168.233760878958 hartree
chargesum: 0.0000000
charge: -0.072029 -0.078652 -0.068879 -0.034080 0.073133 -0.290664 -0.296920 -0.327473 -0.127689 -0.069750 0.162111 0.065850 -0.185772 -0.190645 0.170143 -0.110753 -0.131965 0.071021 -0.083178 -0.183332 0.074539 -0.078121 -0.098503 0.054166 0.071577 0.150972 0.138946 0.142401 0.116349 0.116095 0.119130 0.124711 0.126050 0.136609 0.133258 0.119597 0.127104 0.134641
qa: -0.0720 -0.0787 -0.0689 -0.0341 0.0731 -0.2907 -0.2969 -0.3275 -0.1277 -0.0698 0.1621 0.0658 -0.1858 -0.1906 0.1701 -0.1108 -0.1320 0.0710 -0.0832 -0.1833 0.0745 -0.0781 -0.0985 0.0542 0.0716 0.1510 0.1389 0.1424 0.1163 0.1161 0.1191 0.1247 0.1261 0.1366 0.1333 0.1196 0.1271 0.1346
va: 1.2556 1.2285 1.2343 2.4229 3.3060 2.9637 2.8482 3.0686 3.9127 3.8292 3.9297 3.5701 4.0401 3.9578 3.7336 3.9925 3.9561 4.0613 3.9712 4.0116 3.9314 3.9990 4.0028 3.9417 4.0407 0.9876 1.0128 0.9987 1.0365 1.0182 1.0173 1.0107 1.0103 1.0158 1.0074 1.0203 1.0105 1.0001
dispcorr: -0.022301448 hartree
energy: -2653.534666599740
dipole: -5.83762 5.42791 -0.40971 15.07849 -15.51518 -0.43669 1.70580 -1.69001 0.01579
magnitude: 0.59901 au
magnitude: 1.52256 debye
