program: Orca
programVersion: 4.2.1
elementType: Cl Cl Cl S N N N N C C C C C C C C C C C C C C C C C H H H H H H H H H H H H H
charge: 0
multiplicity: 1
keywords: wb97x-d3
keywords: def2-TZVPP
keywords: def2/J RIJCOSX GRIDX6 NOFINALGRIDX
keywords: grid4 nofinalgrid
keywords: scfconv7
keywords: smallprint printgap noloewdin
keywords: NOSOSCF
formula: C17H13Cl3N4S
InChI: InChI=1/C17H13Cl3N4S/c18-13-3-1-12(2-4-13)9-25-17(8-24-11-21-10-22-24)23-16-6-5-14(19)7-15(16)20/h1-7,10-11H,8-9H2
38 atoms
Cl 1.465465 0.827281 3.453733
Cl -4.029475 -2.012588 -3.597783
Cl 4.108938 -3.269552 1.216932
S  -1.652038 2.846838 0.723109
N  1.796123 1.824056 -0.579051
N  -0.35778 0.587108 1.059452
N  3.025558 1.374964 -0.311933
N  2.3880 0.746761 -2.367743
C  1.030741 2.544913 0.401764
C  -2.977173 1.647754 1.048979
C  -0.246097 1.806993 0.766692
C  -3.233398 0.732775 -0.111633
C  -3.01638 -0.635261 -0.000567
C  -3.701553 1.236368 -1.321242
C  0.72311 -0.29027 1.10491
C  -3.2626 -1.486573 -1.066792
C  -3.949089 0.400417 -2.396338
C  1.429021 1.437505 -1.811157
C  1.630013 -0.309449 2.162431
C  0.8688 -1.245013 0.101038
C  -3.726059 -0.961855 -2.261627
C  2.666089 -1.226866 2.209005
C  1.90899 -2.153844 0.12106
C  2.80545 -2.137989 1.178317
C  3.341457 0.736134 -1.410295
H  0.801203 3.547846 0.035464
H  1.656625 2.65359 1.287559
H  -3.85104 2.263831 1.269057
H  -2.724981 1.093207 1.952082
H  -2.639434 -1.043982 0.927338
H  -3.870388 2.300802 -1.434037
H  -3.091551 -2.549608 -0.967586
H  -4.314163 0.802241 -3.331288
H  0.468791 1.67491 -2.245044
H  0.156512 -1.254448 -0.713434
H  3.360798 -1.218307 3.036565
H  2.020031 -2.869237 -0.681301
H  4.293647 0.243631 -1.526424
totalener: -2653.51027963 hartree
nucrepener: 2777.44283820 hartree
electener: -5430.95311783 hartree
oneelecener: -9170.39968487 hartree
twoeener: 3739.44656704 hartree
kineticenergy: 2647.22933759 hartree
xcener: -168.235060939544 hartree
chargesum: 0.0000000
charge: -0.078069 -0.075228 -0.076505 -0.051732 0.122906 -0.284933 -0.293880 -0.319565 -0.111013 -0.085411 0.122324 0.074633 -0.182597 -0.203473 0.197590 -0.125993 -0.108583 0.024107 -0.021254 -0.207093 0.074709 -0.090386 -0.111941 0.074135 0.065432 0.122816 0.147801 0.143608 0.121570 0.123295 0.112665 0.127511 0.124600 0.146248 0.130647 0.110937 0.124600 0.135519
qa: -0.0781 -0.0752 -0.0765 -0.0517 0.1229 -0.2849 -0.2939 -0.3196 -0.1110 -0.0854 0.1223 0.0746 -0.1826 -0.2035 0.1976 -0.1260 -0.1086 0.0241 -0.0213 -0.2071 0.0747 -0.0904 -0.1119 0.0741 0.0654 0.1228 0.1478 0.1436 0.1216 0.1233 0.1127 0.1275 0.1246 0.1462 0.1306 0.1109 0.1246 0.1355
va: 1.2501 1.2324 1.2266 2.4095 3.2923 2.9713 2.8326 3.0407 3.8781 3.8374 3.9745 3.5514 3.9718 4.0359 3.7501 3.9599 3.9903 4.0844 3.9884 3.9433 3.9438 4.0544 3.9996 3.9061 4.0249 1.0093 1.0183 0.9984 1.0362 1.0160 1.0176 1.0098 1.0106 1.0048 1.0088 1.0216 1.0112 1.0016
dispcorr: -0.025534195 hartree
energy: -2653.535813825804
dipole: -9.19228 8.11378 -1.07849 11.14478 -10.07647 1.06831 -3.96540 4.40503 0.43963
magnitude: 1.58041 au
magnitude: 4.01709 debye
