program: Orca
programVersion: 4.2.1
elementType: Cl Cl Cl S N N N N C C C C C C C C C C C C C C C C C H H H H H H H H H H H H H
charge: 0
multiplicity: 1
keywords: wb97x-d3
keywords: def2-TZVPP
keywords: def2/J RIJCOSX GRIDX6 NOFINALGRIDX
keywords: grid4 nofinalgrid
keywords: scfconv7
keywords: smallprint printgap noloewdin
keywords: NOSOSCF
formula: C17H13Cl3N4S
InChI: InChI=1/C17H13Cl3N4S/c18-13-3-1-12(2-4-13)9-25-17(8-24-11-21-10-22-24)23-16-6-5-14(19)7-15(16)20/h1-7,10-11H,8-9H2
38 atoms
Cl 2.278635 1.478811 -2.595125
Cl -4.904559 -2.665634 1.75508
Cl 4.251686 -3.181464 -0.812533
S  -1.508193 2.983094 -0.441762
N  1.689048 1.704558 1.356784
N  -0.088903 0.814866 -0.837991
N  1.033356 1.11831 2.361418
N  3.162983 0.417335 2.294134
C  1.012088 2.618554 0.485031
C  -2.625738 1.914769 -1.395979
C  -0.103399 1.95232 -0.300963
C  -3.180482 0.770486 -0.600192
C  -2.902897 -0.543256 -0.956762
C  -3.998134 1.002407 0.500845
C  0.975541 -0.074844 -0.802341
C  -3.432309 -1.605416 -0.240306
C  -4.531266 -0.046466 1.229518
C  2.95932 1.270578 1.327474
C  2.10771 0.070582 -1.602733
C  0.877644 -1.22351 -0.017663
C  -4.243968 -1.349217 0.851814
C  3.114783 -0.880596 -1.617284
C  1.881649 -2.171611 -0.005143
C  2.997716 -1.996836 -0.809036
C  1.95454 0.354486 2.894263
H  1.736505 3.03148 -0.219309
H  0.61488 3.447562 1.073085
H  -2.095885 1.568243 -2.282505
H  -3.420519 2.587137 -1.724774
H  -2.255365 -0.74461 -1.799584
H  -4.21642 2.018602 0.806569
H  -3.210939 -2.623648 -0.528763
H  -5.164256 0.145572 2.084527
H  3.67944 1.598408 0.593234
H  -0.003465 -1.351349 0.596621
H  3.98198 -0.743701 -2.247622
H  1.796337 -3.044203 0.626687
H  1.752139 -0.265755 3.753071
totalener: -2653.51149891 hartree
nucrepener: 2769.79327015 hartree
electener: -5423.30476906 hartree
oneelecener: -9155.26066189 hartree
twoeener: 3731.95589283 hartree
kineticenergy: 2647.23161355 hartree
xcener: -168.236765031326 hartree
chargesum: 0.0000000
charge: -0.078127 -0.080385 -0.073078 -0.054477 0.117043 -0.286000 -0.300328 -0.315826 -0.152218 -0.090143 0.204586 0.069006 -0.181893 -0.174548 0.226173 -0.127379 -0.110448 0.046014 -0.107441 -0.205334 0.076759 -0.092501 -0.099488 0.092041 0.055854 0.136994 0.124390 0.117485 0.142851 0.117257 0.110534 0.124773 0.121426 0.144499 0.132513 0.115064 0.121626 0.132724
qa: -0.0781 -0.0804 -0.0731 -0.0545 0.1170 -0.2860 -0.3003 -0.3158 -0.1522 -0.0901 0.2046 0.0690 -0.1819 -0.1745 0.2262 -0.1274 -0.1104 0.0460 -0.1074 -0.2053 0.0768 -0.0925 -0.0995 0.0920 0.0559 0.1370 0.1244 0.1175 0.1429 0.1173 0.1105 0.1248 0.1214 0.1445 0.1325 0.1151 0.1216 0.1327
va: 1.2514 1.2267 1.2307 2.4066 3.2866 2.9936 2.8316 3.0445 3.9460 3.8499 3.9128 3.5875 3.9760 4.0434 3.6731 3.9735 4.0046 4.0613 3.9596 3.9487 3.9349 4.0016 4.0083 3.9176 4.0534 1.0047 1.0147 1.0352 0.9977 1.0161 1.0181 1.0105 1.0115 0.9999 1.0167 1.0218 1.0116 1.0022
dispcorr: -0.025220485 hartree
energy: -2653.536719393601
dipole: -8.44956 8.03006 -0.41949 10.99613 -9.77067 1.22546 3.18852 -3.83784 -0.64932
magnitude: 1.44892 au
magnitude: 3.68285 debye
