program: Orca
programVersion: 4.2.1
elementType: Cl Cl Cl S N N N N C C C C C C C C C C C C C C C C C H H H H H H H H H H H H H
charge: 0
multiplicity: 1
keywords: wb97x-d3
keywords: def2-TZVPP
keywords: def2/J RIJCOSX GRIDX6 NOFINALGRIDX
keywords: grid4 nofinalgrid
keywords: scfconv7
keywords: smallprint printgap noloewdin
keywords: NOSOSCF
formula: C17H13Cl3N4S
InChI: InChI=1/C17H13Cl3N4S/c18-13-3-1-12(2-4-13)9-25-17(8-24-11-21-10-22-24)23-16-6-5-14(19)7-15(16)20/h1-7,10-11H,8-9H2
38 atoms
Cl 1.354571 0.295126 3.537727
Cl -3.962775 -1.481066 -3.922669
Cl 3.998439 -3.464842 0.768812
S  -1.713514 2.732167 1.101616
N  1.863452 1.962605 -0.149856
N  -0.387348 0.47032 1.078791
N  1.478615 1.837154 -1.422033
N  3.540974 1.003005 -1.136227
C  0.979225 2.536788 0.821783
C  -3.01863 1.474824 1.222336
C  -0.291067 1.722033 0.994594
C  -3.245559 0.737628 -0.064315
C  -3.677059 1.411188 -1.20205
C  -3.038837 -0.633937 -0.142275
C  0.685444 -0.408646 1.011469
C  -3.900613 0.737562 -2.39013
C  -3.262146 -1.324546 -1.323272
C  3.096424 1.454139 0.005203
C  1.542986 -0.631293 2.087837
C  0.867242 -1.178871 -0.136491
C  -3.690766 -0.631907 -2.442967
C  2.557618 -1.572775 2.024901
C  1.886477 -2.106612 -0.222976
C  2.728407 -2.301094 0.861478
C  2.513878 1.256001 -1.975912
H  0.734954 3.55837 0.526001
H  1.498426 2.585326 1.780526
H  -3.906344 2.036991 1.518642
H  -2.768773 0.795196 2.036203
H  -3.829889 2.483241 -1.169722
H  -2.687371 -1.173058 0.727212
H  -4.232991 1.271912 -3.269078
H  -3.09856 -2.392223 -1.371121
H  3.612692 1.433782 0.952921
H  0.197493 -1.022387 -0.971412
H  3.208722 -1.726979 2.873676
H  2.02698 -2.675984 -1.130653
H  2.533556 1.010732 -3.026035
totalener: -2653.51138499 hartree
nucrepener: 2775.36041559 hartree
electener: -5428.87180059 hartree
oneelecener: -9166.40818891 hartree
twoeener: 3737.53638832 hartree
kineticenergy: 2647.23406802 hartree
xcener: -168.237093675764 hartree
chargesum: 0.0000000
charge: -0.076553 -0.080393 -0.072738 -0.053433 0.116972 -0.286617 -0.300897 -0.315650 -0.143024 -0.089686 0.196111 0.071979 -0.174006 -0.186490 0.219694 -0.107685 -0.126309 0.044225 -0.096264 -0.197136 0.073976 -0.107114 -0.109594 0.100773 0.056247 0.121628 0.136549 0.142137 0.118477 0.109168 0.117684 0.121767 0.124867 0.145864 0.135839 0.115563 0.121077 0.132990
qa: -0.0766 -0.0804 -0.0727 -0.0534 0.1170 -0.2866 -0.3009 -0.3157 -0.1430 -0.0897 0.1961 0.0720 -0.1740 -0.1865 0.2197 -0.1077 -0.1263 0.0442 -0.0963 -0.1971 0.0740 -0.1071 -0.1096 0.1008 0.0562 0.1216 0.1365 0.1421 0.1185 0.1092 0.1177 0.1218 0.1249 0.1459 0.1358 0.1156 0.1211 0.1330
va: 1.2528 1.2268 1.2312 2.4071 3.2854 2.9917 2.8310 3.0424 3.9432 3.8483 3.9200 3.5825 4.0468 3.9739 3.6825 4.0027 3.9676 4.0597 3.9611 3.9374 3.9381 4.0133 4.0230 3.9088 4.0515 1.0150 1.0067 0.9981 1.0349 1.0191 1.0166 1.0113 1.0104 0.9985 1.0146 1.0220 1.0122 1.0023
dispcorr: -0.025340431 hartree
energy: -2653.536725425119
dipole: -7.90412 7.29298 -0.61114 11.81052 -10.88427 0.92625 -1.34635 2.25509 0.90874
magnitude: 1.43431 au
magnitude: 3.64573 debye
