program: Orca
programVersion: 4.2.1
elementType: Cl Cl Cl S N N N N C C C C C C C C C C C C C C C C C H H H H H H H H H H H H H
charge: 0
multiplicity: 1
keywords: wb97x-d3
keywords: def2-TZVPP
keywords: def2/J RIJCOSX GRIDX6 NOFINALGRIDX
keywords: grid4 nofinalgrid
keywords: scfconv7
keywords: smallprint printgap noloewdin
keywords: NOSOSCF
formula: C17H13Cl3N4S
InChI: InChI=1/C17H13Cl3N4S/c18-13-3-1-12(2-4-13)9-25-17(8-24-11-21-10-22-24)23-16-6-5-14(19)7-15(16)20/h1-7,10-11H,8-9H2
38 atoms
Cl 1.670934 0.38661 3.002521
Cl -4.593007 -2.5053 -2.697323
Cl 3.734251 -3.598591 0.054789
S  -1.514441 2.953255 0.180746
N  2.222605 2.072593 -0.439763
N  -0.188039 0.755089 0.723345
N  2.67184 2.685066 0.65821
N  4.251755 1.343867 -0.198227
C  0.88789 2.31084 -0.903079
C  -2.768844 1.895215 0.964573
C  -0.176218 1.831803 0.07147
C  -3.23302 0.793016 0.06023
C  -2.966108 -0.53724 0.360846
C  -3.933114 1.083956 -1.107096
C  0.758898 -0.246077 0.549325
C  -3.383074 -1.557612 -0.480915
C  -4.357455 0.077447 -1.956636
C  3.179686 1.273084 -0.939242
C  1.677787 -0.543408 1.55581
C  0.746155 -1.048415 -0.589361
C  -4.075332 -1.24281 -1.637725
C  2.60075 -1.56301 1.402387
C  1.652236 -2.082796 -0.748426
C  2.58604 -2.324938 0.245547
C  3.889844 2.217604 0.766953
H  0.751581 1.797582 -1.8566
H  0.760935 3.377914 -1.094516
H  -3.582859 2.57933 1.211509
H  -2.360845 1.511175 1.898346
H  -2.417007 -0.784428 1.259261
H  -4.144884 2.114599 -1.3658
H  -3.166512 -2.588413 -0.237177
H  -4.903575 0.314621 -2.859067
H  3.044181 0.664729 -1.82017
H  -0.004965 -0.867599 -1.348373
H  3.324808 -1.757868 2.180458
H  1.627094 -2.698039 -1.636978
H  4.543846 2.516002 1.570668
totalener: -2653.50928773 hartree
nucrepener: 2771.13254465 hartree
electener: -5424.64183238 hartree
oneelecener: -9157.87533537 hartree
twoeener: 3733.23350299 hartree
kineticenergy: 2647.23666510 hartree
xcener: -168.236531640039 hartree
chargesum: 0.0000000
charge: -0.052226 -0.077802 -0.071759 -0.050223 0.115268 -0.294794 -0.301680 -0.317483 -0.117884 -0.081657 0.189299 0.039414 -0.168878 -0.189067 0.243005 -0.129669 -0.115502 0.039623 -0.063873 -0.282552 0.078107 -0.075453 -0.108236 0.086172 0.062140 0.125832 0.124126 0.141643 0.124614 0.125982 0.114435 0.127138 0.123481 0.141285 0.128657 0.108946 0.127268 0.132306
qa: -0.0522 -0.0778 -0.0718 -0.0502 0.1153 -0.2948 -0.3017 -0.3175 -0.1179 -0.0817 0.1893 0.0394 -0.1689 -0.1891 0.2430 -0.1297 -0.1155 0.0396 -0.0639 -0.2826 0.0781 -0.0755 -0.1082 0.0862 0.0621 0.1258 0.1241 0.1416 0.1246 0.1260 0.1144 0.1271 0.1235 0.1413 0.1287 0.1089 0.1273 0.1323
va: 1.2672 1.2294 1.2319 2.4057 3.2892 2.9276 2.8290 3.0454 3.9507 3.8326 3.9421 3.5909 3.9504 4.0413 3.5698 3.9729 3.9950 4.0610 3.9974 3.9872 3.9290 4.0135 3.9799 3.9157 4.0459 0.9958 1.0131 0.9990 1.0363 1.0180 1.0166 1.0108 1.0112 1.0024 1.0104 1.0267 1.0101 1.0041
dispcorr: -0.025524949 hartree
energy: -2653.534812683318
dipole: -7.44063 6.32264 -1.11800 13.45731 -12.80286 0.65444 -4.25386 3.54732 -0.70654
magnitude: 1.47561 au
magnitude: 3.75069 debye
