program: Orca
programVersion: 4.2.1
elementType: Cl Cl Cl S N N N N C C C C C C C C C C C C C C C C C H H H H H H H H H H H H H
charge: 0
multiplicity: 1
keywords: wb97x-d3
keywords: def2-TZVPP
keywords: def2/J RIJCOSX GRIDX6 NOFINALGRIDX
keywords: grid4 nofinalgrid
keywords: scfconv7
keywords: smallprint printgap noloewdin
keywords: NOSOSCF
formula: C17H13Cl3N4S
InChI: InChI=1/C17H13Cl3N4S/c18-13-3-1-12(2-4-13)9-25-17(8-24-11-21-10-22-24)23-16-6-5-14(19)7-15(16)20/h1-7,10-11H,8-9H2
38 atoms
Cl 1.314626 0.726846 3.465407
Cl -3.833498 -1.976417 -3.709687
Cl 3.811744 -3.476284 1.25487
S  -1.655051 2.927001 0.686867
N  1.922022 1.892663 -0.371303
N  -0.401106 0.645431 0.981216
N  1.563355 1.608828 -1.625633
N  3.584812 0.750076 -1.169881
C  1.035392 2.619858 0.489059
C  -2.997007 1.7301 0.945073
C  -0.262545 1.872067 0.739655
C  -3.198306 0.806062 -0.219874
C  -3.063972 -0.567973 -0.064684
C  -3.532709 1.304572 -1.474211
C  0.635421 -0.27525 1.044521
C  -3.263601 -1.430886 -1.130782
C  -3.730721 0.457298 -2.550691
C  3.130385 1.367439 -0.113202
C  1.472264 -0.391354 2.153434
C  0.795391 -1.195694 0.009072
C  -3.594016 -0.910548 -2.370903
C  2.444809 -1.375133 2.229464
C  1.77376 -2.168967 0.059999
C  2.594678 -2.256246 1.173944
C  2.588908 0.922737 -2.065764
H  0.830092 3.597786 0.050543
H  1.534071 2.784056 1.445965
H  -3.879014 2.350955 1.114911
H  -2.797092 1.179132 1.863437
H  -2.786286 -0.974447 0.898819
H  -3.625981 2.373573 -1.623082
H  -3.155801 -2.49844 -0.997503
H  -3.986084 0.856081 -3.522497
H  3.622282 1.457222 0.843382
H  0.141369 -1.121464 -0.849285
H  3.080122 -1.444198 3.101054
H  1.897653 -2.857505 -0.763635
H  2.624849 0.536182 -3.072026
totalener: -2653.51122104 hartree
nucrepener: 2782.15100681 hartree
electener: -5435.66222785 hartree
oneelecener: -9180.01047521 hartree
twoeener: 3744.34824737 hartree
kineticenergy: 2647.23331862 hartree
xcener: -168.237228534165 hartree
chargesum: 0.0000000
charge: -0.077662 -0.080843 -0.073035 -0.054691 0.115415 -0.283655 -0.300432 -0.316268 -0.146317 -0.090122 0.198006 0.078043 -0.188225 -0.173839 0.225316 -0.127820 -0.109516 0.046058 -0.100989 -0.201323 0.075936 -0.100481 -0.108193 0.097201 0.056182 0.122448 0.136377 0.142108 0.117496 0.115904 0.109838 0.124210 0.122097 0.145732 0.135475 0.115194 0.121188 0.133187
qa: -0.0777 -0.0808 -0.0730 -0.0547 0.1154 -0.2837 -0.3004 -0.3163 -0.1463 -0.0901 0.1980 0.0780 -0.1882 -0.1738 0.2253 -0.1278 -0.1095 0.0461 -0.1010 -0.2013 0.0759 -0.1005 -0.1082 0.0972 0.0562 0.1224 0.1364 0.1421 0.1175 0.1159 0.1098 0.1242 0.1221 0.1457 0.1355 0.1152 0.1212 0.1332
va: 1.2517 1.2262 1.2309 2.4057 3.2873 2.9989 2.8312 3.0430 3.9452 3.8516 3.9167 3.5834 3.9739 4.0449 3.6733 3.9667 4.0030 4.0590 3.9550 3.9416 3.9331 4.0085 4.0213 3.9133 4.0521 1.0148 1.0062 0.9977 1.0346 1.0171 1.0194 1.0106 1.0113 0.9988 1.0141 1.0220 1.0120 1.0022
dispcorr: -0.025501576 hartree
energy: -2653.536722615199
dipole: -7.61970 7.00318 -0.61652 11.99425 -10.91733 1.07692 -3.04182 3.80295 0.76113
magnitude: 1.45573 au
magnitude: 3.70018 debye
