program: Orca
programVersion: 4.2.1
elementType: Cl Cl Cl S N N N N C C C C C C C C C C C C C C C C C H H H H H H H H H H H H H
charge: 0
multiplicity: 1
keywords: wb97x-d3
keywords: def2-TZVPP
keywords: def2/J RIJCOSX GRIDX6 NOFINALGRIDX
keywords: grid4 nofinalgrid
keywords: scfconv7
keywords: smallprint printgap noloewdin
keywords: NOSOSCF
formula: C17H13Cl3N4S
InChI: InChI=1/C17H13Cl3N4S/c18-13-3-1-12(2-4-13)9-25-17(8-24-11-21-10-22-24)23-16-6-5-14(19)7-15(16)20/h1-7,10-11H,8-9H2
38 atoms
Cl -0.272058 -1.436277 0.977389
Cl -4.805293 -2.235175 1.109739
Cl 3.212019 -4.611114 -1.582696
S  -0.31759 2.896526 -0.15139
N  2.186161 2.669572 1.255853
N  0.438136 0.581084 -1.136268
N  2.935164 3.47636 0.49778
N  2.429165 4.470045 2.443868
C  1.77514 1.384125 0.774395
C  -1.721518 2.382984 -1.184443
C  0.681982 1.465602 -0.271124
C  -2.490758 1.229909 -0.610365
C  -3.058531 1.313409 0.656578
C  -2.654729 0.057036 -1.33546
C  1.127434 -0.623586 -1.191433
C  -3.7721 0.254588 1.19061
C  -3.371587 -1.010181 -0.818332
C  1.888956 3.282754 2.414083
C  0.867591 -1.666043 -0.298447
C  2.043628 -0.858136 -2.215455
C  -3.923629 -0.905543 0.446311
C  1.501703 -2.892535 -0.416365
C  2.6935 -2.072062 -2.338429
C  2.416883 -3.087325 -1.435897
C  3.05613 4.541635 1.249178
H  1.395663 0.801802 1.61677
H  2.63953 0.857279 0.369013
H  -1.358628 2.162235 -2.187139
H  -2.340446 3.280525 -1.248016
H  -2.93282 2.214057 1.24539
H  -2.204128 -0.034934 -2.314867
H  -4.209017 0.329667 2.176737
H  -3.485394 -1.920655 -1.389895
H  1.286173 2.827118 3.184881
H  2.241699 -0.064186 -2.923056
H  1.280996 -3.684292 0.285451
H  3.407705 -2.228852 -3.134506
H  3.619863 5.402962 0.927794
totalener: -2653.51231116 hartree
nucrepener: 2746.84593164 hartree
electener: -5400.35824280 hartree
oneelecener: -9109.10184891 hartree
twoeener: 3708.74360611 hartree
kineticenergy: 2647.23801960 hartree
xcener: -168.236467754559 hartree
chargesum: -0.0000000
charge: -0.073480 -0.080708 -0.070229 -0.050937 0.051173 -0.280291 -0.293188 -0.325300 -0.078194 -0.065374 0.166546 0.082261 -0.207055 -0.186510 0.149541 -0.107604 -0.109303 0.061038 -0.028059 -0.215591 0.066075 -0.089481 -0.074063 0.055534 0.070633 0.121169 0.138711 0.114989 0.140545 0.112990 0.111695 0.122888 0.120917 0.141798 0.126553 0.120678 0.125125 0.134506
qa: -0.0735 -0.0807 -0.0702 -0.0509 0.0512 -0.2803 -0.2932 -0.3253 -0.0782 -0.0654 0.1665 0.0823 -0.2071 -0.1865 0.1495 -0.1076 -0.1093 0.0610 -0.0281 -0.2156 0.0661 -0.0895 -0.0741 0.0555 0.0706 0.1212 0.1387 0.1150 0.1405 0.1130 0.1117 0.1229 0.1209 0.1418 0.1266 0.1207 0.1251 0.1345
va: 1.2534 1.2245 1.2337 2.4100 3.3661 2.9511 2.8467 3.0619 3.8991 3.8382 3.9289 3.5516 4.0551 3.9732 3.7236 3.9801 3.9659 4.0700 3.9961 4.0406 3.9204 4.0066 3.9703 3.9402 4.0524 1.0089 1.0045 1.0345 0.9994 1.0201 1.0189 1.0114 1.0110 1.0010 1.0189 1.0195 1.0100 1.0002
dispcorr: -0.023479307 hartree
energy: -2653.535790465652
dipole: 1.94655 -2.02932 -0.08277 20.42929 -20.42533 0.00396 -3.59603 3.14669 -0.44934
magnitude: 0.45692 au
magnitude: 1.16140 debye
