program: Orca
programVersion: 4.2.1
elementType: Cl Cl Cl S N N N N C C C C C C C C C C C C C C C C C H H H H H H H H H H H H H
charge: 0
multiplicity: 1
keywords: wb97x-d3
keywords: def2-TZVPP
keywords: def2/J RIJCOSX GRIDX6 NOFINALGRIDX
keywords: grid4 nofinalgrid
keywords: scfconv7
keywords: smallprint printgap noloewdin
keywords: NOSOSCF
formula: C17H13Cl3N4S
InChI: InChI=1/C17H13Cl3N4S/c18-13-3-1-12(2-4-13)9-25-17(8-24-11-21-10-22-24)23-16-6-5-14(19)7-15(16)20/h1-7,10-11H,8-9H2
38 atoms
Cl 0.051349 -1.123746 0.951331
Cl -4.290627 -2.021806 1.905089
Cl 3.067279 -4.631058 -1.768888
S  -0.264273 3.024641 -0.662155
N  1.991967 2.509225 1.129237
N  0.362716 0.607258 -1.469821
N  2.316379 3.805828 1.094298
N  1.488754 3.254672 3.10413
C  2.064842 1.698092 -0.04972
C  -1.810068 2.372189 -1.358233
C  0.74138 1.598687 -0.787219
C  -2.419219 1.275504 -0.533864
C  -2.721466 0.049169 -1.111422
C  -2.703973 1.464242 0.814253
C  1.050232 -0.597944 -1.506173
C  -3.303727 -0.967548 -0.372275
C  -3.279812 0.456315 1.568989
C  1.48627 2.199615 2.333955
C  0.956546 -1.523731 -0.463041
C  1.779632 -0.964174 -2.635158
C  -3.57776 -0.756993 0.967979
C  1.571811 -2.762596 -0.538394
C  2.405365 -2.194265 -2.722762
C  2.298329 -3.089635 -1.670296
C  2.002517 4.210131 2.299866
H  2.417978 0.700694 0.211162
H  2.808003 2.144405 -0.711891
H  -1.631382 2.046124 -2.382034
H  -2.464811 3.24563 -1.399244
H  -2.486119 -0.123761 -2.153539
H  -2.460378 2.405305 1.292372
H  -3.528256 -1.919566 -0.832441
H  -3.497186 0.612771 2.616536
H  1.141765 1.209612 2.591112
H  1.844239 -0.266021 -3.459107
H  1.482704 -3.461528 0.281158
H  2.969815 -2.455999 -3.606507
H  2.154164 5.23047 2.614222
totalener: -2653.51094152 hartree
nucrepener: 2788.39436948 hartree
electener: -5441.90531100 hartree
oneelecener: -9192.18993934 hartree
twoeener: 3750.28462834 hartree
kineticenergy: 2647.23740154 hartree
xcener: -168.236962078156 hartree
chargesum: -0.0000000
charge: -0.074299 -0.081093 -0.069552 -0.028120 0.077121 -0.277251 -0.301359 -0.326387 -0.117656 -0.071772 0.148416 0.106329 -0.193492 -0.226706 0.170470 -0.102693 -0.105126 0.059814 -0.058846 -0.219405 0.063507 -0.078633 -0.074210 0.050033 0.072127 0.148325 0.139183 0.110614 0.140299 0.107941 0.118743 0.120568 0.125722 0.138567 0.125322 0.123328 0.125294 0.134878
qa: -0.0743 -0.0811 -0.0696 -0.0281 0.0771 -0.2773 -0.3014 -0.3264 -0.1177 -0.0718 0.1484 0.1063 -0.1935 -0.2267 0.1705 -0.1027 -0.1051 0.0598 -0.0588 -0.2194 0.0635 -0.0786 -0.0742 0.0500 0.0721 0.1483 0.1392 0.1106 0.1403 0.1079 0.1187 0.1206 0.1257 0.1386 0.1253 0.1233 0.1253 0.1349
va: 1.2552 1.2236 1.2340 2.4312 3.3125 2.9499 2.8445 3.0603 3.8961 3.8402 3.9449 3.5189 3.9788 4.0409 3.7100 3.9650 3.9641 4.0602 3.9726 4.0517 3.9121 3.9895 3.9774 3.9507 4.0402 0.9903 1.0122 1.0361 0.9987 1.0186 1.0199 1.0112 1.0104 1.0189 1.0173 1.0186 1.0103 0.9999
dispcorr: -0.024665686 hartree
energy: -2653.535607205958
dipole: 0.57227 -0.34554 0.22672 19.13798 -19.06319 0.07479 -5.99590 4.71980 -1.27610
magnitude: 1.29824 au
magnitude: 3.29986 debye
