program: Orca
programVersion: 4.2.1
elementType: Cl Cl Cl S N N N N C C C C C C C C C C C C C C C C C H H H H H H H H H H H H H
charge: 0
multiplicity: 1
keywords: wb97x-d3
keywords: def2-TZVPP
keywords: def2/J RIJCOSX GRIDX6 NOFINALGRIDX
keywords: grid4 nofinalgrid
keywords: scfconv7
keywords: smallprint printgap noloewdin
keywords: NOSOSCF
formula: C17H13Cl3N4S
InChI: InChI=1/C17H13Cl3N4S/c18-13-3-1-12(2-4-13)9-25-17(8-24-11-21-10-22-24)23-16-6-5-14(19)7-15(16)20/h1-7,10-11H,8-9H2
38 atoms
Cl 1.647542 -0.027729 3.089984
Cl -4.410573 -2.107654 -3.047305
Cl 3.706404 -3.512117 -0.442801
S  -1.641805 2.880828 0.826524
N  2.11521 2.18897 -0.166797
N  -0.20517 0.688975 0.909024
N  2.80564 1.548412 -1.116398
N  4.043833 1.776298 0.73866
C  0.759604 2.601315 -0.386506
C  -2.833491 1.625197 1.387071
C  -0.252405 1.868284 0.476415
C  -3.238323 0.687953 0.28927
C  -3.94585 1.154651 -0.814514
C  -2.90559 -0.659988 0.344812
C  0.757571 -0.250881 0.560719
C  -4.313259 0.302186 -1.840687
C  -3.265205 -1.527077 -0.675912
C  2.871345 2.315392 0.936113
C  1.66225 -0.719727 1.511531
C  0.764765 -0.841667 -0.699685
C  -3.965785 -1.038724 -1.765556
C  2.579632 -1.709677 1.207735
C  1.660074 -1.847424 -1.01323
C  2.56949 -2.270361 -0.058515
C  3.952017 1.317022 -0.528944
H  0.531203 2.424118 -1.437845
H  0.665272 3.677352 -0.219648
H  -3.682776 2.206383 1.751094
H  -2.402971 1.094933 2.235128
H  -4.207571 2.203828 -0.882856
H  -2.348631 -1.04095 1.190174
H  -4.864034 0.674841 -2.693079
H  -2.995805 -2.572762 -0.623307
H  2.526809 2.792862 1.840559
H  0.045585 -0.512418 -1.438142
H  3.290361 -2.036255 1.953171
H  1.653889 -2.29231 -1.998042
H  4.754822 0.802236 -1.032228
totalener: -2653.50891135 hartree
nucrepener: 2780.17132373 hartree
electener: -5433.68023508 hartree
oneelecener: -9176.00055534 hartree
twoeener: 3742.32032025 hartree
kineticenergy: 2647.23678266 hartree
xcener: -168.236874376546 hartree
chargesum: -0.0000000
charge: -0.073906 -0.076591 -0.077257 -0.062478 0.119105 -0.282473 -0.298234 -0.313628 -0.110655 -0.080524 0.150187 0.038910 -0.191030 -0.166896 0.205479 -0.111604 -0.128198 0.011795 -0.082622 -0.204219 0.076838 -0.039176 -0.067750 0.037175 0.067177 0.139371 0.131312 0.142345 0.123149 0.113619 0.126422 0.124681 0.126914 0.151292 0.114053 0.112271 0.121348 0.133798
qa: -0.0739 -0.0766 -0.0773 -0.0625 0.1191 -0.2825 -0.2982 -0.3136 -0.1107 -0.0805 0.1502 0.0389 -0.1910 -0.1669 0.2055 -0.1116 -0.1282 0.0118 -0.0826 -0.2042 0.0768 -0.0392 -0.0677 0.0372 0.0672 0.1394 0.1313 0.1423 0.1231 0.1136 0.1264 0.1247 0.1269 0.1513 0.1141 0.1123 0.1213 0.1338
va: 1.2497 1.2305 1.2255 2.3929 3.3019 2.9225 2.8373 3.0395 3.8962 3.8377 3.9649 3.5908 4.0408 3.9473 3.6781 3.9930 3.9742 4.0767 3.9419 4.0378 3.9323 3.9593 3.9882 3.9281 4.0291 1.0066 1.0024 0.9990 1.0368 1.0175 1.0165 1.0106 1.0113 1.0068 1.0144 1.0228 1.0105 1.0023
dispcorr: -0.025810118 hartree
energy: -2653.534721468737
dipole: -7.97991 6.72130 -1.25861 14.52186 -13.39572 1.12614 -0.81960 0.86074 0.04114
magnitude: 1.68937 au
magnitude: 4.29404 debye
