program: Gaussian 09
title: 000073544
version: EM64L-G09RevD.01
frameworkgroup: C1[X(C6H12O5)]
method: RPBEPBE
basis: SDD
operation: Freq
keyword: #pfreq=noraman
keyword: PBEPBE/SDD
title: #p freq=noraman PBEPBE/SDD
converged: YES YES NO NO
title: Mulliken charges:
elementType: O O O O O C C C C C C H H H H H H H H H H H H
charge: -0.289468 -0.453955 -0.439380 -0.441828 -0.439200 -0.178043 -0.128023 -0.033565 -0.192285 -0.361650 -0.342401 0.244306 0.276385 0.251002 0.278702 0.198720 0.189663 0.234463 0.222237 0.347198 0.349734 0.350701 0.356687
chargesum: 0.00000
title: Mulliken charges with hydrogens summed into heavy atoms:
elementType: O O O O O C C C C C C
charge: -0.289468 -0.106757 -0.089646 -0.091127 -0.082513 0.066263 0.148362 0.217437 0.086417 0.026733 0.114299
polarizability: 8.86444490e+01 1.34646680e+00 7.70338291e+01 -1.79687230e+00 -7.48566948e-01 7.29055673e+01
1716.lowfreq: -15.9628 -0.0006 0.0007 0.0008 5.6643 11.5605 35.6410 79.1549 102.7007
frequency: 35.3400 79.1318 102.6767 124.4372 149.7012 168.6366 191.7633 224.4001 250.7718 269.3787 314.8200 360.2519 380.1603 426.1736 433.4826 486.0544 522.2089 555.1062 645.0673 741.9805 772.3922 856.3225 911.4335 950.6095 954.8846 970.2316 989.7651 1008.7207 1015.7938 1033.4704 1043.1431 1073.4038 1088.8932 1137.9172 1178.8585 1195.8643 1205.2040 1223.2231 1238.6405 1249.3724 1273.5280 1285.8231 1300.8464 1325.7801 1342.2597 1359.8182 1372.5537 1384.8437 1411.8619 1455.2920 1478.5899 2928.5201 2985.9235 2991.0415 3004.4329 3010.4371 3059.8566 3078.3983 3107.1165 3508.2306 3524.4141 3570.6971 3582.4014
redmass: 6.0438 5.1962 5.0885 3.0757 2.5265 1.6457 2.2716 1.3238 2.6117 4.4577 5.0139 5.1257 1.1120 3.7515 3.3304 1.1740 3.8338 3.3458 4.2065 3.5443 3.7739 3.2156 2.9124 3.8746 5.9710 2.4910 3.7352 2.6210 4.1660 2.5084 2.7873 1.9370 1.9752 1.1627 1.2134 1.2595 1.2272 1.1850 1.3405 1.4238 1.3774 1.3466 1.2835 1.3653 1.1745 1.3810 1.3039 1.2585 1.5171 1.0804 1.0889 1.0575 1.0969 1.0662 1.0873 1.0884 1.0882 1.0991 1.0883 1.0653 1.0657 1.0667 1.0668
irintensity: 1.6323 5.4595 4.9915 13.6219 27.3228 66.8990 70.6224 102.7851 48.2283 18.1773 9.2511 2.8271 112.8730 8.8580 13.8642 155.7239 15.6876 8.9861 15.2621 8.1883 24.9727 45.0015 70.8303 48.2297 115.9662 38.9740 59.8827 8.2575 17.4741 58.9165 21.1970 30.6603 1.5157 11.4960 19.6537 37.8139 17.9065 19.3036 14.1996 21.7317 10.6009 10.5774 13.2975 15.1198 43.6232 1.0912 14.7132 23.1513 2.3734 7.2963 7.2771 59.9855 23.2173 14.8980 37.7803 54.0852 6.5751 36.5707 11.3485 8.6512 5.5071 7.5103 5.9188
temp: 298.150 k
press: 1.00000 atm
elementType: 8 8 8 8 8 6 6 6 6 6 6 1 1 1 1 1 1 1 1 1 1 1 1
symmnumber: 1
zpe: 483903.5 jmol-1
zpe.correction: 0.184309 hartree
zpe.thermalcorrener: 0.196779 hartree
zpe.thermalcorrenthalpy: 0.197723 hartree
zpe.thermalcorrgfe: 0.145564 hartree
zpe.sumelectzpe: -610.992452 hartree
zpe.sumelectthermal: -610.979983 hartree
zpe.sumelectthermalent: -610.979038 hartree
zpe.sumelectthermalfe: -611.031197 hartree
dipole: 4.5164 -2.0821 0.5054
dipole: 4.9988
quadrupole: -59.6417 -79.1589 -62.3931
quadrupole: 2.0027 -0.7181 -4.5395
quadrupole: 7.4228 -12.0943 4.6715 2.0027 -0.7181 -4.5395
hfenergy: -611.1767615 hartree
pointgroup: C01 [X(C6H12O5)]
dipole: -1.8369607 0.5622154 -0.421134 debye
dipolederiv: -0.9436352 -0.0026357 -0.1024555 0.0300977 -0.4897358 -0.0076304 -0.0040058 0.0755925 -0.4169898 -0.1651033 0.0276423 0.0091303 0.0913472 -0.6465272 -0.1179003 0.0122212 -0.155853 -0.7633994 -0.560273 0.1499624 0.0306779 0.1202585 -0.296709 0.1713046 0.0665913 0.2118314 -0.7275194 -0.5155235 -0.1731771 0.1716331 -0.2153677 -0.7862205 -0.1249601 0.1987021 -0.0531615 -0.2829881 -0.2985574 0.1123913 0.0701594 0.1863607 -0.7658445 0.1073868 0.0303026 0.0938261 -0.5658168 0.0734966 -0.076783 0.0409424 -0.0231136 0.322694 0.126085 0.030678 0.1528085 0.5633145 0.2398489 0.0386763 0.0271476 -0.0850029 0.2296313 -0.0923773 -0.0913524 -0.1210897 0.5353823 0.5678903 -0.0940907 -0.0582668 -0.1655261 0.0948841 -0.0962921 -0.1861991 -0.0745208 0.1757397 0.5290252 0.1046517 0.0427888 0.2219903 0.1450691 0.0819146 0.0892343 0.0036846 0.1641954 0.3488532 0.1799252 -0.0631233 0.1982655 0.682381 0.0937133 -0.0993421 0.077044 0.2649733 0.2235086 -0.0461579 -0.0577626 -0.1137484 0.5216812 0.0421555 -0.0540256 -0.0332147 0.2298782 -0.0487203 0.102638 -0.0719691 0.087614 -0.0124905 0.0176155 -0.0612196 0.0293723 -0.0627508 0.035721 -0.0814939 -0.0486664 -0.0709638 -0.0023944 -0.0416957 -0.0277301 -0.0200719 0.0181011 0.0026408 0.0076145 0.0107137 0.0135745 0.0313333 0.0418459 0.087928 0.0392157 -0.0996562 -0.0476763 -0.0112721 0.0459886 0.0031164 0.0694601 -0.0482348 0.0819733 -0.0160944 -0.0457059 0.0514702 -0.0458625 0.0823833 -0.0641474 -0.0415871 0.0468777 0.0404316 0.0908725 -0.146136 -0.1132961 0.0979245 0.0400376 0.0658569 -0.1584403 -0.0484289 0.0651327 -0.0765831 0.0322243 0.0039236 0.0496091 0.1145702 0.0228754 -0.0049632 -0.0150331 0.0874676 -0.0418445 -0.0415644 -0.0942318 -0.0996551 -0.0472729 -0.0535874 -0.0085777 -0.0129584 -0.0287734 -0.0065746 0.0877291 0.0285455 -0.0130783 0.0792041 -0.0613336 0.3868167 0.0354884 0.032141 0.0169394 0.2727355 0.3169365 -0.0824733 -0.0645849 -0.07221 0.1005009 -0.1272302 -0.0468964 -0.0918088 0.3095993 0.2275448 -0.047557 -0.1787313 -0.012309 0.2932663 0.0254384 -0.1974949 -0.0116179 0.1672896 0.1376118 -0.0967986 -0.0725443 -0.1040471 0.3357724 -0.0570841 -0.0257643 -0.088752 0.3313645 unknown
polarizability: 86.0028454|2.9633989|77.8794725|5.272887|1.2816106|74.7015275 unknown
InChI: InChI=1S/C6H12O5/c7-1-3-5(9)6(10)4(2-8)11-3/h3-10H,1-2H2
charge 0 multiplicity 1
23 atoms
O  0.169562 -0.943963 -0.650716
O  -0.48735 1.51583 1.675838
O  0.588268 1.773307 -1.81618
O  -2.631347 -1.970557 -0.639381
O  2.299035 -1.917439 0.955463
C  -0.643401 1.177455 0.253421
C  0.745784 1.341292 -0.420192
C  -1.008351 -0.327415 0.035761
C  1.353812 -0.06901 -0.351555
C  -2.250725 -0.565748 -0.81559
C  1.976373 -0.487777 0.990851
H  -1.360725 1.864693 -0.236548
H  1.336665 2.125538 0.074439
H  -1.145749 -0.818686 1.019501
H  2.067927 -0.258349 -1.17132
H  -2.022789 -0.326146 -1.876018
H  -3.067698 0.104108 -0.465023
H  1.296509 -0.244072 1.831099
H  2.935717 0.034512 1.147785
H  -1.371582 1.507445 2.120847
H  0.305513 0.984363 -2.34976
H  -3.272455 -2.238342 -1.343465
H  1.50361 -2.379841 0.577441
