program: Orca
programVersion: 4.2.1
elementType: Cl Cl Cl S N N N N C C C C C C C C C C C C C C C C C H H H H H H H H H H H H H
charge: 0
multiplicity: 1
keywords: wb97x-d3
keywords: def2-TZVPP
keywords: def2/J RIJCOSX GRIDX6 NOFINALGRIDX
keywords: grid4 nofinalgrid
keywords: scfconv7
keywords: smallprint printgap noloewdin
keywords: NOSOSCF
formula: C17H13Cl3N4S
InChI: InChI=1/C17H13Cl3N4S/c18-13-3-1-12(2-4-13)9-25-17(8-24-11-21-10-22-24)23-16-6-5-14(19)7-15(16)20/h1-7,10-11H,8-9H2
38 atoms
Cl -2.264213 -1.530256 -2.610576
Cl 4.643911 2.684304 2.022376
Cl -4.268535 3.131134 -0.861731
S  1.554031 -2.97333 -0.473179
N  -1.612636 -1.668032 1.350018
N  0.117337 -0.820725 -0.898153
N  -2.88501 -1.301514 1.173169
N  -1.954029 -0.136736 2.851029
C  -0.952419 -2.608558 0.481672
C  2.708662 -1.89039 -1.362832
C  0.138695 -1.955405 -0.346148
C  3.191362 -0.746855 -0.521374
C  3.927979 -0.982372 0.636173
C  2.919119 0.567771 -0.882101
C  -0.953679 0.062417 -0.86129
C  4.379577 0.064646 1.422771
C  3.366576 1.629481 -0.109051
C  -1.071432 -0.960422 2.344303
C  -2.099683 -0.11048 -1.637539
C  -0.848484 1.232821 -0.110532
C  4.089798 1.366202 1.041993
C  -3.11655 0.829512 -1.654048
C  -1.862951 2.171667 -0.092792
C  -2.992983 1.960443 -0.867217
C  -3.039331 -0.383624 2.090106
H  -1.702138 -3.044361 -0.178895
H  -0.542107 -3.423972 1.078651
H  2.240063 -1.54894 -2.284388
H  3.531811 -2.552377 -1.638313
H  4.152675 -1.99761 0.939474
H  2.349139 0.774989 -1.777444
H  4.949588 -0.134947 2.31979
H  3.146413 2.646329 -0.403806
H  -0.048857 -1.08396 2.666369
H  0.045199 1.396504 0.477484
H  -3.995456 0.669669 -2.263058
H  -1.764167 3.060868 0.514254
H  -3.981102 0.123798 2.225738
elementType: Cl S N C H
totalener: -2653.52800375 hartree
nucrepener: 2783.19661239 hartree
electener: -5436.72461614 hartree
oneelecener: -9182.11839170 hartree
twoeener: 3745.39377556 hartree
cpcmener: -0.02872802 hartree
kineticenergy: 2647.22811526 hartree
xcener: -168.237088883417 hartree
chargesum: 0.0000000
charge: -0.085174 -0.104265 -0.097761 -0.069600 0.124956 -0.283695 -0.330701 -0.401897 -0.080294 -0.043439 0.127205 0.066642 -0.220571 -0.199481 0.183195 -0.135056 -0.143430 0.057449 -0.012757 -0.230164 0.084208 -0.111180 -0.122262 0.075501 0.073001 0.150318 0.142536 0.119154 0.156077 0.137866 0.135627 0.145856 0.146025 0.170971 0.148596 0.123888 0.144649 0.158009
qa: -0.0852 -0.1043 -0.0978 -0.0696 0.1250 -0.2837 -0.3307 -0.4019 -0.0803 -0.0434 0.1272 0.0666 -0.2206 -0.1995 0.1832 -0.1351 -0.1434 0.0574 -0.0128 -0.2302 0.0842 -0.1112 -0.1223 0.0755 0.0730 0.1503 0.1425 0.1192 0.1561 0.1379 0.1356 0.1459 0.1460 0.1710 0.1486 0.1239 0.1446 0.1580
va: 1.2427 1.2018 1.2043 2.4075 3.3399 2.9894 2.8645 3.0074 3.8643 3.8109 3.9891 3.5371 4.0102 3.9488 3.7528 3.9644 3.9344 4.0675 3.9258 3.9241 3.8254 4.0433 3.9783 3.8216 4.0258 1.0118 1.0079 1.0336 0.9981 1.0105 1.0121 1.0035 1.0037 0.9975 1.0043 1.0190 1.0041 0.9978
dispcorr: -0.025698154 hartree
energy: -2653.553701905033
dipole: 10.39603 -8.86868 1.52735 -10.47314 8.61062 -1.86252 3.70199 -4.17307 -0.47107
magnitude: 2.45432 au
magnitude: 6.23838 debye
