program: Orca
programVersion: 4.2.1
elementType: Cl Cl Cl S N N N N C C C C C C C C C C C C C C C C C H H H H H H H H H H H H H
charge: 0
multiplicity: 1
keywords: wb97x-d3
keywords: def2-TZVPP
keywords: def2/J RIJCOSX GRIDX6 NOFINALGRIDX
keywords: grid4 nofinalgrid
keywords: scfconv7
keywords: smallprint printgap noloewdin
keywords: NOSOSCF
formula: C17H13Cl3N4S
InChI: InChI=1/C17H13Cl3N4S/c18-13-3-1-12(2-4-13)9-25-17(8-24-11-21-10-22-24)23-16-6-5-14(19)7-15(16)20/h1-7,10-11H,8-9H2
38 atoms
Cl -1.645668 -0.733314 3.225946
Cl 3.897643 2.018236 -3.612677
Cl -3.719966 3.638361 0.898988
S  1.731053 -2.852951 0.826436
N  -1.938816 -2.024851 -0.312368
N  0.336813 -0.640554 0.946051
N  -1.691001 -1.567408 -1.542174
N  -3.756189 -0.986713 -0.881929
C  -0.936375 -2.733683 0.42888
C  3.004664 -1.588985 1.111102
C  0.275919 -1.881663 0.743276
C  3.219868 -0.689739 -0.069421
C  3.661659 -1.206602 -1.283962
C  2.995712 0.678548 0.030981
C  -0.695042 0.281429 0.908747
C  3.872698 -0.382525 -2.377429
C  3.20547 1.520016 -1.051813
C  -3.165867 -1.663445 0.069583
C  -1.632607 0.41663 1.933463
C  -0.722447 1.223927 -0.120212
C  3.639733 0.978685 -2.250053
C  -2.563246 1.442653 1.942644
C  -1.652004 2.245618 -0.138624
C  -2.564021 2.351581 0.899807
C  -2.804594 -0.949704 -1.835824
H  -0.63825 -3.620177 -0.131953
H  -1.376815 -3.084702 1.363133
H  3.902171 -2.170645 1.328632
H  2.755341 -1.026118 2.009016
H  3.84195 -2.269665 -1.387408
H  2.649085 1.100949 0.964578
H  4.214742 -0.7981 -3.315374
H  3.024305 2.582055 -0.957997
H  -3.587602 -1.931424 1.025693
H  0.008619 1.147063 -0.913524
H  -3.27721 1.522966 2.750492
H  -1.65446 2.957178 -0.952574
H  -2.9440 -0.456903 -2.784839
elementType: Cl S N C H
totalener: -2653.52945827 hartree
nucrepener: 2784.50463896 hartree
electener: -5438.03409724 hartree
oneelecener: -9185.08169552 hartree
twoeener: 3747.04759828 hartree
cpcmener: -0.02940797 hartree
kineticenergy: 2647.23777233 hartree
xcener: -168.240324082219 hartree
chargesum: -0.0000000
charge: -0.083785 -0.104645 -0.096276 -0.078049 0.118344 -0.276210 -0.338134 -0.392491 -0.118603 -0.046645 0.179569 0.083995 -0.223639 -0.212502 0.220671 -0.135194 -0.143299 0.069811 -0.071262 -0.254345 0.085098 -0.074692 -0.102280 0.058917 0.060248 0.137312 0.154332 0.155368 0.119488 0.136625 0.135111 0.146600 0.145011 0.170956 0.141871 0.124537 0.145527 0.162660
qa: -0.0838 -0.1046 -0.0963 -0.0780 0.1183 -0.2762 -0.3381 -0.3925 -0.1186 -0.0466 0.1796 0.0840 -0.2236 -0.2125 0.2207 -0.1352 -0.1433 0.0698 -0.0713 -0.2543 0.0851 -0.0747 -0.1023 0.0589 0.0602 0.1373 0.1543 0.1554 0.1195 0.1366 0.1351 0.1466 0.1450 0.1710 0.1419 0.1245 0.1455 0.1627
va: 1.2445 1.2014 1.2080 2.3911 3.3470 3.0128 2.8532 3.0203 3.9104 3.8115 3.9400 3.5214 4.0215 3.9436 3.6727 3.9626 3.9293 4.0568 3.9540 3.9742 3.8248 3.9916 3.9636 3.8532 4.0545 1.0141 0.9953 0.9986 1.0315 1.0119 1.0119 1.0033 1.0042 0.9982 1.0115 1.0189 1.0024 0.9961
dispcorr: -0.025597648 hartree
energy: -2653.555055922344
dipole: 8.42234 -7.38322 1.03913 -12.31484 10.55094 -1.76390 -1.77749 3.02311 1.24562
magnitude: 2.39639 au
magnitude: 6.09114 debye
