program: Gaussian 09
title: 000007485
version: EM64L-G09RevD.01
frameworkgroup: C1[X(C7H7NO3)]
method: RPBEPBE
basis: SDD
operation: Freq
keyword: #pfreq=noraman
keyword: PBEPBE/SDD
title: #p freq=noraman PBEPBE/SDD
converged: YES YES YES YES
title: Mulliken charges:
elementType: O O O N C C C C C C C H H H H H H H
charge: -0.249024 -0.218893 -0.220369 0.021111 0.331955 0.377579 -0.313027 -0.311133 -0.332082 -0.354603 -0.536833 0.263974 0.253207 0.288925 0.285203 0.229737 0.229736 0.254537
chargesum: 0.00000
title: Mulliken charges with hydrogens summed into heavy atoms:
elementType: O O O N C C C C C C C
charge: -0.249024 -0.218893 -0.220369 0.021111 0.331955 0.377579 -0.049054 -0.057925 -0.043157 -0.069400 0.177177
polarizability: 1.65130652e+02 -1.15872183e+00 9.81493657e+01 7.60888789e-03 -4.43459109e-03 4.13154562e+01
1716.lowfreq: -9.2214 -5.9591 -0.0013 -0.0012 -0.0009 3.8920 66.4156 79.8034 139.4334
frequency: 66.3392 79.7952 139.4302 173.3057 212.0159 264.5203 303.8766 334.0210 419.3950 464.7150 496.1967 516.5528 595.2625 625.0655 665.8168 734.7696 738.3839 803.8535 818.7993 851.4745 974.9386 979.2295 987.3353 993.2542 1095.8845 1107.1816 1111.1483 1153.8491 1169.9256 1226.4836 1242.5186 1290.0537 1353.0176 1403.8928 1433.9661 1437.4038 1468.8329 1469.2995 1483.3103 1589.3184 1614.4337 2971.7342 3065.1029 3138.2149 3167.3558 3169.4422 3185.8633 3190.6858
redmass: 6.0434 4.6722 4.5879 4.9842 1.1377 4.4544 5.0217 8.9073 3.0123 5.2916 3.0244 5.8772 6.6393 7.0609 4.5362 4.8133 7.6449 7.6463 1.2701 1.6626 1.3378 8.1045 1.3356 2.8770 3.0739 1.2651 1.2592 1.3473 1.3736 5.6790 3.9145 1.2843 8.4712 7.6422 1.4860 2.4950 1.0496 1.1121 2.2557 7.7666 6.5461 1.0326 1.1046 1.1002 1.0880 1.0891 1.0962 1.0974
irintensity: 0.3407 0.0343 11.3765 2.8245 0.1141 4.4496 0.3094 0.7042 0.0906 3.5955 9.9262 1.7365 24.9403 3.6346 23.8660 5.5463 1.8425 16.1891 5.9176 77.3982 3.0736 59.5325 0.3163 0.6701 19.0636 24.4184 0.1225 25.2914 190.7459 399.9996 167.9917 0.4599 92.3634 33.2760 1.2321 24.5634 15.9092 57.5187 38.2434 30.0112 190.8923 56.9515 38.8329 17.7884 3.8088 1.3517 2.6325 4.6908
temp: 298.150 k
press: 1.00000 atm
elementType: 8 8 8 7 6 6 6 6 6 6 6 1 1 1 1 1 1 1
symmnumber: 1
zpe: 345584.8 jmol-1
zpe.correction: 0.131626 hartree
zpe.thermalcorrener: 0.141296 hartree
zpe.thermalcorrenthalpy: 0.142240 hartree
zpe.thermalcorrgfe: 0.096139 hartree
zpe.sumelectzpe: -550.466522 hartree
zpe.sumelectthermal: -550.456852 hartree
zpe.sumelectthermalent: -550.455908 hartree
zpe.sumelectthermalfe: -550.502009 hartree
dipole: 6.8862 -1.0463 0.0007
dipole: 6.9652
quadrupole: -70.6799 -59.6939 -64.7033
quadrupole: -7.5369 -0.0002 -0.0018
quadrupole: -5.6542 5.3318 0.3224 -7.5369 -0.0002 -0.0018
hfenergy: -550.5981486 hartree
pointgroup: C01 [X(C7H7N1O3)]
dipole: 2.6976952 -0.4814409 0.0002908 debye
dipolederiv: -1.951599 0.2250402 -0.0001112 0.0553049 -0.3222421 0.0000062 -0.0000791 0.0000148 -0.2949443 -0.8387669 0.2144478 -0.0000207 0.346413 -0.6569182 -0.0000254 -0.0000908 0.0000449 -0.2402785 -0.7672324 -0.20151 -0.0000283 -0.3788557 -0.7106269 -0.0000108 -0.0000672 -0.0000609 -0.2408813 2.1167794 0.01704 0.0001114 0.0814708 1.0863186 0.0000597 0.0001541 0.000026 0.1938728 1.767682 -0.0601797 0.000086 0.2784214 0.1431867 0.0000158 0.0000373 -0.0000064 0.1334277 -1.0261564 0.0001353 -0.0000727 -0.0482962 -0.1029322 -0.0000114 -0.0000441 0.0000009 0.0233581 -0.5793176 0.0879519 -0.0000328 0.4016521 0.0343696 -0.0000072 -0.0000623 -0.000021 -0.1660861 -0.5440907 -0.060049 -0.0000155 -0.5126457 -0.055017 -0.000043 0.0000454 -0.000017 -0.1995182 0.39426 0.0094992 0.0000183 0.2894339 0.0480529 -0.0000003 0.0000316 -0.0000134 -0.0976526 0.4622749 -0.0246268 0.0000357 -0.2256567 0.0330145 -0.0000322 0.0000476 -0.0000077 -0.0851372 0.7305598 -0.161305 0.0000412 -0.5369452 0.3765734 -0.0000346 0.0000889 -0.0000148 0.3166064 0.0578867 -0.0613899 0.0000015 -0.0575976 -0.0005804 0.0000197 -0.0000064 0.0000213 0.1695273 0.0169068 0.0816504 -0.0000172 0.089045 -0.0038609 0.0000247 -0.0000197 0.0000235 0.1667944 0.0933312 0.0692189 -0.0000104 0.0199314 0.0646409 0.0000155 -0.0000111 0.0000126 0.1713408 0.1036702 -0.0556919 0.0000041 -0.0190489 0.0500627 0.0000172 0.0000051 0.0000061 0.169248 0.0449002 -0.0245867 -0.0676741 0.147407 -0.0280684 -0.0961223 0.0036845 -0.1030473 -0.0743054 0.0448943 -0.0245816 0.0676944 0.1473946 -0.0280199 0.0961259 -0.0037093 0.1030335 -0.074348 -0.1259826 -0.031063 -0.0000097 -0.0774279 0.0720467 0.0000025 -0.0000043 0.0000049 0.1289761 unknown
polarizability: 165.0262633|-2.8850992|98.253754|0.0074919|-0.0046295|41.3154562 unknown
InChI: InChI=1S/C7H7NO3/c1-11-7-4-2-6(3-5-7)8(9)10/h2-5H,1H3
charge 0 multiplicity 1
18 atoms
O  3.05828 0.436027 0.000095
O  -3.271156 0.987115 -0.000209
O  -3.100568 -1.289968 -0.000241
N  -2.577143 -0.105568 -0.000082
C  1.684598 0.216381 0.000063
C  -1.108341 0.006224 -0.000029
C  0.88496 1.392747 -0.000116
C  1.075164 -1.068174 0.000194
C  -0.511675 1.291617 -0.000157
C  -0.327794 -1.169669 0.00014
C  3.950269 -0.731595 0.000287
H  1.38635 2.364453 -0.00022
H  1.678662 -1.979569 0.000332
H  -1.150465 2.178308 -0.000283
H  -0.829261 -2.141078 0.000224
H  3.79867 -1.348243 -0.905633
H  3.798571 -1.348021 0.906342
H  4.965882 -0.312087 0.000291
