program: Orca
programVersion: 4.2.1
elementType: Cl Cl Cl S N N N N C C C C C C C C C C C C C C C C C H H H H H H H H H H H H H
charge: 0
multiplicity: 1
keywords: wb97x-d3
keywords: def2-TZVPP
keywords: def2/J RIJCOSX GRIDX6 NOFINALGRIDX
keywords: grid4 nofinalgrid
keywords: scfconv7
keywords: smallprint printgap noloewdin
keywords: NOSOSCF
formula: C17H13Cl3N4S
InChI: InChI=1/C17H13Cl3N4S/c18-13-3-1-12(2-4-13)9-25-17(8-24-11-21-10-22-24)23-16-6-5-14(19)7-15(16)20/h1-7,10-11H,8-9H2
38 atoms
Cl -1.527296 -0.306748 3.378404
Cl 3.395724 1.720607 -3.792559
Cl -3.677245 3.610671 0.405507
S  1.77339 -2.809078 1.209017
N  -1.816141 -2.060517 -0.087568
N  0.436557 -0.562314 1.088234
N  -1.460374 -1.870079 -1.360185
N  -3.505011 -1.026383 -0.973869
C  -0.907953 -2.654864 0.852016
C  3.081421 -1.55201 1.241686
C  0.340713 -1.81804 1.044332
C  3.168189 -0.745737 -0.021651
C  3.155896 0.643074 0.036315
C  3.268295 -1.359749 -1.265316
C  -0.592264 0.350795 0.926918
C  3.234539 1.410394 -1.115567
C  3.341166 -0.609848 -2.428694
C  -3.027717 -1.544241 0.12861
C  -1.529483 0.628687 1.92277
C  -0.628287 1.128884 -0.231242
C  3.319118 0.773225 -2.342326
C  -2.477692 1.62786 1.7754
C  -1.575413 2.119687 -0.404604
C  -2.493869 2.363665 0.604431
C  -2.500854 -1.245518 -1.844907
H  -0.648693 -3.658518 0.514822
H  -1.419634 -2.765028 1.808608
H  3.993257 -2.130587 1.403524
H  2.944488 -0.912536 2.112168
H  3.0710 1.141472 0.993069
H  3.277043 -2.439971 -1.340546
H  3.216732 2.489743 -1.052224
H  3.413371 -1.101946 -3.38893
H  -3.524099 -1.590259 1.085399
H  0.105709 0.942768 -1.003722
H  -3.193828 1.81872 2.562606
H  -1.5879 2.699065 -1.31723
H  -2.543654 -0.941521 -2.878841
elementType: Cl S N C H
totalener: -2653.52842846 hartree
nucrepener: 2810.57765944 hartree
electener: -5464.10608791 hartree
oneelecener: -9237.26794271 hartree
twoeener: 3773.16185480 hartree
cpcmener: -0.02847768 hartree
kineticenergy: 2647.24757663 hartree
xcener: -168.242231389852 hartree
chargesum: 0.0000000
charge: -0.080767 -0.106795 -0.095995 -0.076052 0.117191 -0.277886 -0.335904 -0.391523 -0.115103 -0.047049 0.180660 0.104793 -0.215971 -0.225136 0.220814 -0.147861 -0.131351 0.075105 -0.080376 -0.230699 0.085154 -0.076341 -0.127161 0.072411 0.057514 0.132479 0.152262 0.151617 0.117859 0.131635 0.132534 0.144051 0.146520 0.168826 0.140284 0.124045 0.144372 0.161842
qa: -0.0808 -0.1068 -0.0960 -0.0761 0.1172 -0.2779 -0.3359 -0.3915 -0.1151 -0.0470 0.1807 0.1048 -0.2160 -0.2251 0.2208 -0.1479 -0.1314 0.0751 -0.0804 -0.2307 0.0852 -0.0763 -0.1272 0.0724 0.0575 0.1325 0.1523 0.1516 0.1179 0.1316 0.1325 0.1441 0.1465 0.1688 0.1403 0.1240 0.1444 0.1618
va: 1.2472 1.1976 1.2074 2.3957 3.3401 3.0228 2.8536 3.0194 3.9246 3.8291 3.9264 3.5372 3.9468 4.0107 3.6746 3.9319 3.9682 4.0567 3.9427 3.9442 3.8077 3.9870 4.0016 3.8386 4.0559 1.0143 0.9988 0.9987 1.0304 1.0109 1.0156 1.0045 1.0027 0.9956 1.0091 1.0186 1.0039 0.9962
dispcorr: -0.026254629 hartree
energy: -2653.554683093941
dipole: 9.06161 -8.06938 0.99223 -12.71236 11.14402 -1.56834 -0.61599 2.11428 1.49829
magnitude: 2.38518 au
magnitude: 6.06265 debye
