program: Orca
programVersion: 4.2.1
elementType: Cl Cl Cl S N N N N C C C C C C C C C C C C C C C C C H H H H H H H H H H H H H
charge: 0
multiplicity: 1
keywords: wb97x-d3
keywords: def2-TZVPP
keywords: def2/J RIJCOSX GRIDX6 NOFINALGRIDX
keywords: grid4 nofinalgrid
keywords: scfconv7
keywords: smallprint printgap noloewdin
keywords: NOSOSCF
formula: C17H13Cl3N4S
InChI: InChI=1/C17H13Cl3N4S/c18-13-3-1-12(2-4-13)9-25-17(8-24-11-21-10-22-24)23-16-6-5-14(19)7-15(16)20/h1-7,10-11H,8-9H2
38 atoms
Cl -1.028683 -0.317573 -1.688672
Cl 3.446111 3.321669 -2.179851
Cl 0.397828 4.314911 0.598198
S  0.917403 -2.718269 0.522782
N  -2.905793 -3.47479 0.446476
N  -1.377601 -1.281287 1.111804
N  -3.21083 -3.539344 -0.852834
N  -4.983261 -2.853016 0.343832
C  -1.558611 -3.652707 0.903196
C  1.932861 -1.39079 1.231798
C  -0.770111 -2.358133 0.867664
C  2.285563 -0.235004 0.337538
C  2.293948 -0.322235 -1.048704
C  2.68285 0.958481 0.933085
C  -0.880443 0.006629 0.991883
C  2.652011 0.76559 -1.829086
C  3.0594 2.050542 0.169044
C  -3.96115 -3.047121 1.139664
C  -0.722749 0.602551 -0.261536
C  -0.666502 0.796354 2.120308
C  3.025645 1.94709 -1.211115
C  -0.342558 1.927564 -0.39339
C  -0.271213 2.116471 2.007874
C  -0.114444 2.671449 0.748548
C  -4.462837 -3.168237 -0.859087
H  -1.087161 -4.425031 0.296772
H  -1.570296 -4.019049 1.930677
H  2.844895 -1.919962 1.521058
H  1.478601 -1.053387 2.162378
H  1.99193 -1.23685 -1.540817
H  2.692638 1.046853 2.012157
H  2.632116 0.688609 -2.907462
H  3.35285 2.97432 0.647051
H  -3.942716 -2.909205 2.209338
H  -0.804154 0.359585 3.100431
H  -0.218299 2.362892 -1.37466
H  -0.085472 2.70698 2.894024
H  -5.03341 -3.129051 -1.773674
elementType: Cl S N C H
totalener: -2653.52645274 hartree
nucrepener: 2858.11000284 hartree
electener: -5511.63645558 hartree
oneelecener: -9332.11353145 hartree
twoeener: 3820.47707586 hartree
cpcmener: -0.03520662 hartree
kineticenergy: 2647.25035951 hartree
xcener: -168.246171132888 hartree
chargesum: -0.0000000
charge: -0.083273 -0.104369 -0.099221 -0.080820 0.092701 -0.287429 -0.340256 -0.423163 -0.025938 -0.014107 0.132545 0.058456 -0.228734 -0.206262 0.174751 -0.119132 -0.171770 0.071826 -0.019112 -0.236773 0.110340 -0.092072 -0.106874 0.081825 0.060173 0.129760 0.144328 0.158981 0.127536 0.124716 0.142393 0.139524 0.138889 0.177298 0.149496 0.119889 0.142007 0.161874
qa: -0.0833 -0.1044 -0.0992 -0.0808 0.0927 -0.2874 -0.3403 -0.4232 -0.0259 -0.0141 0.1325 0.0585 -0.2287 -0.2063 0.1748 -0.1191 -0.1718 0.0718 -0.0191 -0.2368 0.1103 -0.0921 -0.1069 0.0818 0.0602 0.1298 0.1443 0.1590 0.1275 0.1247 0.1424 0.1395 0.1389 0.1773 0.1495 0.1199 0.1420 0.1619
va: 1.2426 1.2030 1.2076 2.4014 3.3923 3.0209 2.8912 3.0163 3.8092 3.8231 4.0253 3.5957 3.9144 3.9343 3.7033 3.9562 3.8952 4.0680 3.9778 3.9847 3.7559 3.9297 3.9384 3.7818 4.0588 1.0166 0.9990 0.9916 1.0154 1.0364 1.0008 1.0078 1.0163 0.9947 1.0084 1.0187 1.0046 0.9947
dispcorr: -0.028200669 hartree
energy: -2653.554653413939
dipole: -1.89928 3.80652 1.90724 -17.90167 16.60054 -1.30113 13.08908 -10.46256 2.62652
magnitude: 3.49702 au
magnitude: 8.88871 debye
