program: Orca
programVersion: 4.2.1
elementType: Cl Cl Cl S N N N N C C C C C C C C C C C C C C C C C H H H H H H H H H H H H H
charge: 0
multiplicity: 1
keywords: wb97x-d3
keywords: def2-TZVPP
keywords: def2/J RIJCOSX GRIDX6 NOFINALGRIDX
keywords: grid4 nofinalgrid
keywords: scfconv7
keywords: smallprint printgap noloewdin
keywords: NOSOSCF
formula: C17H13Cl3N4S
InChI: InChI=1/C17H13Cl3N4S/c18-13-3-1-12(2-4-13)9-25-17(8-24-11-21-10-22-24)23-16-6-5-14(19)7-15(16)20/h1-7,10-11H,8-9H2
38 atoms
Cl 0.877858 1.775355 0.81745
Cl 5.2152 2.183423 0.43007
Cl -3.577947 4.437481 -0.578092
S  0.45286 -2.935287 0.135533
N  -2.497114 -2.784469 1.027911
N  -0.390692 -0.525786 -0.50393
N  -3.275605 -2.794287 -0.056539
N  -3.379676 -4.766634 1.008804
C  -1.640619 -1.663014 1.313672
C  1.660242 -2.413729 -1.110563
C  -0.579543 -1.524812 0.243867
C  2.531759 -1.263224 -0.697977
C  3.165653 -1.233851 0.53888
C  2.748723 -0.2131 -1.581885
C  -1.187264 0.612156 -0.458213
C  3.9925 -0.179243 0.892679
C  3.579712 0.844972 -1.250421
C  -2.559718 -3.965612 1.642969
C  -0.681307 1.794948 0.08288
C  -2.458636 0.640905 -1.026542
C  4.1913 0.854103 -0.008685
C  -1.408875 2.972973 0.054375
C  -3.199451 1.809701 -1.06804
C  -2.66555 2.968125 -0.528354
C  -3.786125 -3.996823 -0.017976
H  -1.170792 -1.831848 2.282396
H  -2.237941 -0.756624 1.391776
H  1.137811 -2.199555 -2.041778
H  2.258116 -3.312133 -1.279303
H  3.01118 -2.03551 1.250277
H  2.256394 -0.209813 -2.546023
H  4.474562 -0.16832 1.860651
H  3.731868 1.656646 -1.948555
H  -2.006453 -4.18888 2.541351
H  -2.867912 -0.267852 -1.446956
H  -0.999133 3.876669 0.48379
H  -4.182911 1.808419 -1.51667
H  -4.484763 -4.334969 -0.766787
elementType: Cl S N C H
totalener: -2653.53046135 hartree
nucrepener: 2729.37260269 hartree
electener: -5382.90306405 hartree
oneelecener: -9074.64036388 hartree
twoeener: 3691.73729983 hartree
cpcmener: -0.03051325 hartree
kineticenergy: 2647.25887557 hartree
xcener: -168.239855659782 hartree
chargesum: -0.0000000
charge: -0.079599 -0.108451 -0.094774 -0.086834 0.114255 -0.274215 -0.363458 -0.414600 -0.100768 -0.037938 0.174143 0.120758 -0.233384 -0.226022 0.139474 -0.126630 -0.126547 0.076396 -0.013073 -0.223456 0.064430 -0.099680 -0.102493 0.056210 0.081556 0.152668 0.149362 0.115300 0.150099 0.129976 0.131009 0.144502 0.141451 0.186114 0.145151 0.127722 0.147955 0.163390
qa: -0.0796 -0.1085 -0.0948 -0.0868 0.1143 -0.2742 -0.3635 -0.4146 -0.1008 -0.0379 0.1741 0.1208 -0.2334 -0.2260 0.1395 -0.1266 -0.1265 0.0764 -0.0131 -0.2235 0.0644 -0.0997 -0.1025 0.0562 0.0816 0.1527 0.1494 0.1153 0.1501 0.1300 0.1310 0.1445 0.1415 0.1861 0.1452 0.1277 0.1480 0.1634
va: 1.2502 1.1950 1.2078 2.3951 3.3246 2.9893 2.8444 3.0229 3.8973 3.8430 3.9058 3.4893 4.0228 3.9901 3.7619 3.9503 3.9367 4.0348 3.9906 3.9940 3.7931 4.0026 3.9793 3.8614 4.0315 1.0040 0.9949 1.0298 0.9985 1.0186 1.0080 1.0040 1.0041 0.9892 1.0345 1.0186 1.0029 0.9932
dispcorr: -0.023332855 hartree
energy: -2653.553794205438
dipole: -4.24414 4.34729 0.10315 -22.30449 21.46285 -0.84164 -2.74529 3.19525 0.44996
magnitude: 0.95993 au
magnitude: 2.43995 debye
