program: Orca
programVersion: 4.2.1
elementType: Cl Cl Cl S N N N N C C C C C C C C C C C C C C C C C H H H H H H H H H H H H H
charge: 0
multiplicity: 1
keywords: wb97x-d3
keywords: def2-TZVPP
keywords: def2/J RIJCOSX GRIDX6 NOFINALGRIDX
keywords: grid4 nofinalgrid
keywords: scfconv7
keywords: smallprint printgap noloewdin
keywords: NOSOSCF
formula: C17H13Cl3N4S
InChI: InChI=1/C17H13Cl3N4S/c18-13-3-1-12(2-4-13)9-25-17(8-24-11-21-10-22-24)23-16-6-5-14(19)7-15(16)20/h1-7,10-11H,8-9H2
38 atoms
Cl -1.505113 -0.482729 3.152931
Cl 3.674958 2.690946 -2.74475
Cl -3.233621 3.727238 0.30873
S  1.57774 -3.15841 0.14846
N  -2.136052 -2.047481 -0.512112
N  0.269365 -0.989941 0.823284
N  -2.671952 -2.471073 0.634602
N  -4.045731 -1.025323 -0.394402
C  -0.8121 -2.445519 -0.898226
C  2.905409 -2.097161 0.801931
C  0.243943 -2.024489 0.101889
C  3.146067 -0.900958 -0.068993
C  3.520391 -1.056766 -1.400778
C  2.962069 0.384411 0.426557
C  -0.602967 0.076241 0.673238
C  3.692289 0.041293 -2.227378
C  3.13084 1.496175 -0.38612
C  -2.958912 -1.180504 -1.106597
C  -1.458028 0.456089 1.707732
C  -0.556283 0.882253 -0.464664
C  3.486876 1.312142 -1.711203
C  -2.275818 1.567846 1.599544
C  -1.356955 2.003365 -0.586587
C  -2.217895 2.332764 0.447146
C  -3.808266 -1.827567 0.662554
H  -0.58458 -2.009062 -1.871029
H  -0.785325 -3.527535 -1.031996
H  3.776115 -2.754516 0.833448
H  2.671069 -1.812189 1.825662
H  3.66873 -2.048441 -1.810134
H  2.66809 0.527965 1.457639
H  3.977674 -0.095532 -3.261332
H  2.971129 2.488987 0.011414
H  -2.735185 -0.710249 -2.050584
H  0.129763 0.627919 -1.262724
H  -2.944256 1.831003 2.407572
H  -1.303821 2.610409 -1.479512
H  -4.504581 -1.94758 1.476903
elementType: Cl S N C H
totalener: -2653.52847203 hartree
nucrepener: 2816.71830544 hartree
electener: -5470.24677748 hartree
oneelecener: -9249.24733103 hartree
twoeener: 3779.00055355 hartree
cpcmener: -0.03344969 hartree
kineticenergy: 2647.25561726 hartree
xcener: -168.242679650371 hartree
chargesum: -0.0000000
charge: -0.082307 -0.104764 -0.096801 -0.078278 0.108998 -0.272288 -0.333189 -0.395013 -0.069718 -0.042453 0.141437 0.052348 -0.229819 -0.187287 0.267579 -0.122573 -0.139762 0.064576 -0.076417 -0.309395 0.081033 -0.077463 -0.078838 0.061443 0.054026 0.146085 0.133112 0.153066 0.117531 0.138644 0.133915 0.146637 0.142919 0.179089 0.149093 0.120415 0.145797 0.158622
qa: -0.0823 -0.1048 -0.0968 -0.0783 0.1090 -0.2723 -0.3332 -0.3950 -0.0697 -0.0425 0.1414 0.0523 -0.2298 -0.1873 0.2676 -0.1226 -0.1398 0.0646 -0.0764 -0.3094 0.0810 -0.0775 -0.0788 0.0614 0.0540 0.1461 0.1331 0.1531 0.1175 0.1386 0.1339 0.1466 0.1429 0.1791 0.1491 0.1204 0.1458 0.1586
va: 1.2370 1.2002 1.2069 2.3872 3.3634 2.9368 2.8571 3.0172 3.9121 3.8256 4.0050 3.5580 4.0145 3.9162 3.5565 3.9552 3.9242 4.0538 3.9156 3.9855 3.8109 3.9996 3.9430 3.8506 4.0616 0.9959 1.0071 0.9992 1.0338 1.0119 1.0146 1.0029 1.0059 0.9891 0.9993 1.0236 1.0020 1.0005
dispcorr: -0.026779475 hartree
energy: -2653.555251508796
dipole: 8.21881 -6.43339 1.78541 -14.28865 13.04669 -1.24197 -5.50195 4.09169 -1.41026
magnitude: 2.59211 au
magnitude: 6.58862 debye
