program: Orca
programVersion: 4.2.1
elementType: Cl Cl Cl S N N N N C C C C C C C C C C C C C C C C C H H H H H H H H H H H H H
charge: 0
multiplicity: 1
keywords: wb97x-d3
keywords: def2-TZVPP
keywords: def2/J RIJCOSX GRIDX6 NOFINALGRIDX
keywords: grid4 nofinalgrid
keywords: scfconv7
keywords: smallprint printgap noloewdin
keywords: NOSOSCF
formula: C17H13Cl3N4S
InChI: InChI=1/C17H13Cl3N4S/c18-13-3-1-12(2-4-13)9-25-17(8-24-11-21-10-22-24)23-16-6-5-14(19)7-15(16)20/h1-7,10-11H,8-9H2
38 atoms
Cl 0.021646 1.148087 0.876847
Cl 4.161718 2.063162 1.87859
Cl -3.143404 4.630062 -1.704543
S  0.243173 -3.03128 -0.739371
N  -1.863658 -2.516634 1.200467
N  -0.433383 -0.610976 -1.505109
N  -2.251902 -3.794633 1.227844
N  -1.079749 -3.285097 3.073937
C  -2.032367 -1.695686 0.032328
C  1.790557 -2.370397 -1.417428
C  -0.767503 -1.600043 -0.793462
C  2.37387 -1.267692 -0.582267
C  2.768219 -0.076853 -1.17989
C  2.544045 -1.413263 0.791131
C  -1.130167 0.59111 -1.504887
C  3.328489 0.949152 -0.434451
C  3.09701 -0.396681 1.553063
C  -1.152019 -2.236684 2.294422
C  -0.9722 1.530382 -0.482582
C  -1.931609 0.940232 -2.589966
C  3.483849 0.77953 0.930201
C  -1.58704 2.771229 -0.534301
C  -2.557141 2.171983 -2.657946
C  -2.377833 3.080574 -1.627019
C  -1.767843 -4.204577 2.370139
H  -2.368395 -0.704123 0.332195
H  -2.825244 -2.129159 -0.577574
H  1.635038 -2.051798 -2.446738
H  2.453259 -3.238382 -1.443816
H  2.63442 0.061835 -2.245047
H  2.231862 -2.325177 1.285595
H  3.624027 1.871634 -0.915171
H  3.220372 -0.522839 2.62001
H  -0.722776 -1.265455 2.484768
H  -2.057544 0.232648 -3.398286
H  -1.447001 3.481146 0.269018
H  -3.174004 2.416386 -3.511173
H  -1.92171 -5.214591 2.715437
elementType: Cl S N C H
totalener: -2653.52910124 hartree
nucrepener: 2802.14221984 hartree
electener: -5455.67132108 hartree
oneelecener: -9219.62093425 hartree
twoeener: 3763.94961317 hartree
cpcmener: -0.02931816 hartree
kineticenergy: 2647.25866313 hartree
xcener: -168.241892720939 hartree
chargesum: -0.0000000
charge: -0.089111 -0.107929 -0.093809 -0.079240 0.092952 -0.281956 -0.344223 -0.407436 -0.089485 -0.029623 0.162165 0.117337 -0.223251 -0.259251 0.173148 -0.122106 -0.119746 0.078494 -0.037908 -0.240051 0.073091 -0.082540 -0.093977 0.053940 0.069469 0.164171 0.151522 0.112925 0.150907 0.131500 0.130878 0.143159 0.143230 0.162045 0.147055 0.130498 0.147503 0.165653
qa: -0.0891 -0.1079 -0.0938 -0.0792 0.0930 -0.2820 -0.3442 -0.4074 -0.0895 -0.0296 0.1622 0.1173 -0.2233 -0.2593 0.1731 -0.1221 -0.1197 0.0785 -0.0379 -0.2401 0.0731 -0.0825 -0.0940 0.0539 0.0695 0.1642 0.1515 0.1129 0.1509 0.1315 0.1309 0.1432 0.1432 0.1620 0.1471 0.1305 0.1475 0.1657
va: 1.2419 1.1956 1.2090 2.3971 3.3397 2.9835 2.8599 3.0207 3.8565 3.8286 3.9432 3.4818 3.9720 4.0147 3.6998 3.9310 3.9220 4.0482 3.9418 4.0358 3.7991 3.9993 3.9541 3.8672 4.0393 0.9862 1.0090 1.0361 0.9982 1.0096 1.0194 1.0035 1.0045 1.0114 1.0095 1.0169 1.0020 0.9937
dispcorr: -0.025184971 hartree
energy: -2653.554286212398
dipole: -0.31957 -0.19275 -0.51232 -19.28036 19.12483 -0.15553 -5.79242 4.02573 -1.76669
magnitude: 1.84604 au
magnitude: 4.69225 debye
