program: Orca
programVersion: 4.2.1
elementType: Cl Cl Cl S N N N N C C C C C C C C C C C C C C C C C H H H H H H H H H H H H H
charge: 0
multiplicity: 1
keywords: wb97x-d3
keywords: def2-TZVPP
keywords: def2/J RIJCOSX GRIDX6 NOFINALGRIDX
keywords: grid4 nofinalgrid
keywords: scfconv7
keywords: smallprint printgap noloewdin
keywords: NOSOSCF
formula: C17H13Cl3N4S
InChI: InChI=1/C17H13Cl3N4S/c18-13-3-1-12(2-4-13)9-25-17(8-24-11-21-10-22-24)23-16-6-5-14(19)7-15(16)20/h1-7,10-11H,8-9H2
38 atoms
Cl -1.593999 -0.016002 3.139212
Cl 3.690392 2.298668 -3.08439
Cl -3.285807 3.649189 -0.407146
S  1.681373 -3.039824 0.802978
N  -2.081376 -2.201707 -0.155413
N  0.27654 -0.837149 0.990476
N  -2.691771 -1.488533 -1.106329
N  -3.985305 -1.637868 0.721063
C  -0.747835 -2.711657 -0.322277
C  2.94441 -1.805305 1.241735
C  0.291165 -2.007665 0.524429
C  3.154973 -0.782782 0.165596
C  2.92259 0.564001 0.419781
C  3.569045 -1.160191 -1.10846
C  -0.622184 0.155541 0.634528
C  3.090072 1.519947 -0.570922
C  3.740309 -0.219496 -2.111411
C  -2.861163 -2.276254 0.926121
C  -1.512821 0.687719 1.565224
C  -0.560549 0.752321 -0.624179
C  3.492785 1.116199 -1.832512
C  -2.344144 1.749589 1.25268
C  -1.369056 1.824946 -0.951184
C  -2.260729 2.311773 -0.009649
C  -3.821108 -1.170145 -0.532864
H  -0.476886 -2.623801 -1.373968
H  -0.742012 -3.77764 -0.086958
H  3.843288 -2.401791 1.408183
H  2.679292 -1.340771 2.189569
H  2.594704 0.877444 1.401819
H  3.75504 -2.203264 -1.332848
H  2.895615 2.562258 -0.358867
H  4.060632 -0.527161 -3.097372
H  -2.579384 -2.814896 1.816841
H  0.142913 0.370907 -1.35282
H  -3.038959 2.131448 1.987645
H  -1.303704 2.270789 -1.933903
H  -4.566846 -0.583108 -1.044803
elementType: Cl S N C H
totalener: -2653.52770486 hartree
nucrepener: 2814.47622271 hartree
electener: -5468.00392757 hartree
oneelecener: -9244.80982326 hartree
twoeener: 3776.80589568 hartree
cpcmener: -0.03041757 hartree
kineticenergy: 2647.24456761 hartree
xcener: -168.240659694841 hartree
chargesum: -0.0000000
charge: -0.087566 -0.104393 -0.098678 -0.080302 0.118737 -0.273357 -0.333170 -0.395783 -0.056464 -0.044798 0.130159 0.057405 -0.191633 -0.229743 0.234265 -0.136007 -0.123364 0.033657 -0.087942 -0.248498 0.080378 -0.059606 -0.096342 0.051143 0.069317 0.149549 0.146101 0.153689 0.119296 0.135227 0.136798 0.141656 0.145919 0.178696 0.141532 0.122027 0.144086 0.158010
qa: -0.0876 -0.1044 -0.0987 -0.0803 0.1187 -0.2734 -0.3332 -0.3958 -0.0565 -0.0448 0.1302 0.0574 -0.1916 -0.2297 0.2343 -0.1360 -0.1234 0.0337 -0.0879 -0.2485 0.0804 -0.0596 -0.0963 0.0511 0.0693 0.1495 0.1461 0.1537 0.1193 0.1352 0.1368 0.1417 0.1459 0.1787 0.1415 0.1220 0.1441 0.1580
va: 1.2366 1.2009 1.2036 2.3864 3.3621 2.9377 2.8710 3.0055 3.8565 3.8227 4.0171 3.5581 3.9110 4.0131 3.6347 3.9246 3.9575 4.0564 3.8868 3.9837 3.8125 3.9709 3.9701 3.8451 4.0335 1.0049 0.9991 0.9989 1.0330 1.0133 1.0125 1.0064 1.0032 0.9979 1.0032 1.0208 1.0028 0.9982
dispcorr: -0.026778724 hartree
energy: -2653.554483582214
dipole: 8.60118 -6.71793 1.88325 -15.48750 13.45820 -2.02930 -1.25009 1.31479 0.06470
magnitude: 2.76927 au
magnitude: 7.03892 debye
