program: Orca
programVersion: 4.2.1
elementType: Cl Cl Cl S N N N N C C C C C C C C C C C C C C C C C H H H H H H H H H H H H H
charge: 0
multiplicity: 1
keywords: wb97x-d3
keywords: def2-TZVPP
keywords: def2/J RIJCOSX GRIDX6 NOFINALGRIDX
keywords: grid4 nofinalgrid
keywords: scfconv7
keywords: smallprint printgap noloewdin
keywords: NOSOSCF
formula: C17H13Cl3N4S
InChI: InChI=1/C17H13Cl3N4S/c18-13-3-1-12(2-4-13)9-25-17(8-24-11-21-10-22-24)23-16-6-5-14(19)7-15(16)20/h1-7,10-11H,8-9H2
38 atoms
Cl -1.453178 -0.355836 3.186462
Cl 3.715348 2.624996 -2.887239
Cl -3.218601 3.735816 0.181144
S  1.636843 -3.140671 0.326904
N  -2.154397 -2.137414 -0.329437
N  0.280688 -0.962877 0.857278
N  -2.783576 -1.309729 -1.16855
N  -4.004029 -1.630108 0.68762
C  -0.844062 -2.658196 -0.609656
C  2.935784 -1.993334 0.879752
C  0.25072 -2.068096 0.252738
C  3.143448 -0.844256 -0.06044
C  3.54898 -1.059087 -1.374557
C  2.926663 0.461304 0.365011
C  -0.610206 0.080809 0.667444
C  3.729926 0.001023 -2.248708
C  3.102655 1.534925 -0.495171
C  -2.889117 -2.311158 0.771381
C  -1.433228 0.52407 1.701187
C  -0.600225 0.815623 -0.517719
C  3.499513 1.29243 -1.799093
C  -2.246876 1.635336 1.559412
C  -1.392797 1.937271 -0.675045
C  -2.215595 2.335426 0.365432
C  -3.877984 -1.030661 -0.512875
H  -0.619935 -2.474339 -1.659984
H  -0.857644 -3.741346 -0.477977
H  3.826333 -2.621974 0.941473
H  2.706568 -1.651433 1.887487
H  3.724423 -2.066144 -1.732442
H  2.607497 0.651847 1.380732
H  4.047158 -0.18102 -3.266292
H  2.923186 2.543301 -0.148645
H  -2.585503 -2.951799 1.583681
H  0.05201 0.504946 -1.323269
H  -2.888921 1.946704 2.371566
H  -1.365545 2.490675 -1.603186
H  -4.627794 -0.374016 -0.924348
elementType: Cl S N C H
totalener: -2653.52759709 hartree
nucrepener: 2809.35768117 hartree
electener: -5462.88527826 hartree
oneelecener: -9234.57059019 hartree
twoeener: 3771.68531193 hartree
cpcmener: -0.03050434 hartree
kineticenergy: 2647.24353293 hartree
xcener: -168.240101986718 hartree
chargesum: 0.0000000
charge: -0.088171 -0.104854 -0.099437 -0.080072 0.120360 -0.273762 -0.334978 -0.395032 -0.056273 -0.043664 0.130382 0.051078 -0.227157 -0.186073 0.228435 -0.126402 -0.139851 0.033534 -0.086334 -0.247883 0.083428 -0.057186 -0.095854 0.051681 0.069565 0.149576 0.147144 0.153874 0.119401 0.138281 0.133885 0.146581 0.142428 0.177721 0.139716 0.122048 0.145764 0.158102
qa: -0.0882 -0.1049 -0.0994 -0.0801 0.1204 -0.2738 -0.3350 -0.3950 -0.0563 -0.0437 0.1304 0.0511 -0.2272 -0.1861 0.2284 -0.1264 -0.1399 0.0335 -0.0863 -0.2479 0.0834 -0.0572 -0.0959 0.0517 0.0696 0.1496 0.1471 0.1539 0.1194 0.1383 0.1339 0.1466 0.1424 0.1777 0.1397 0.1220 0.1458 0.1581
va: 1.2361 1.2005 1.2029 2.3890 3.3627 2.9356 2.8707 3.0072 3.8538 3.8191 4.0192 3.5585 4.0126 3.9118 3.6365 3.9597 3.9306 4.0573 3.8920 3.9825 3.8157 3.9721 3.9631 3.8443 4.0319 1.0053 0.9990 0.9986 1.0329 1.0114 1.0141 1.0030 1.0061 0.9986 1.0055 1.0208 1.0021 0.9981
dispcorr: -0.026606352 hartree
energy: -2653.554203439113
dipole: 7.92622 -6.12031 1.80591 -15.50511 13.41757 -2.08754 -3.52837 3.26393 -0.26444
magnitude: 2.77291 au
magnitude: 7.04819 debye
