program: Orca
programVersion: 4.2.1
elementType: Cl Cl Cl S N N N N C C C C C C C C C C C C C C C C C H H H H H H H H H H H H H
charge: 0
multiplicity: 1
keywords: wb97x-d3
keywords: def2-TZVPP
keywords: def2/J RIJCOSX GRIDX6 NOFINALGRIDX
keywords: grid4 nofinalgrid
keywords: scfconv7
keywords: smallprint printgap noloewdin
keywords: NOSOSCF
formula: C17H13Cl3N4S
InChI: InChI=1/C17H13Cl3N4S/c18-13-3-1-12(2-4-13)9-25-17(8-24-11-21-10-22-24)23-16-6-5-14(19)7-15(16)20/h1-7,10-11H,8-9H2
38 atoms
Cl -1.726384 -0.672273 3.198521
Cl 4.422434 1.77055 -3.666261
Cl -4.070783 3.526594 0.814782
S  1.732337 -2.655063 0.933366
N  -1.954125 -2.033018 -0.296254
N  0.246761 -0.492691 0.916682
N  -1.725067 -1.585135 -1.532944
N  -3.832857 -1.136037 -0.904997
C  -0.918188 -2.6652 0.467406
C  2.95016 -1.346151 1.25669
C  0.245206 -1.743852 0.768365
C  3.305563 -0.563692 0.029027
C  4.01592 -1.166814 -1.005997
C  2.950856 0.774786 -0.097347
C  -0.839433 0.365865 0.864005
C  4.363696 -0.458261 -2.144039
C  3.291344 1.500723 -1.230243
C  -3.206565 -1.749642 0.065964
C  -1.785074 0.454745 1.887026
C  -0.925415 1.293289 -0.175171
C  3.993642 0.874571 -2.246065
C  -2.778448 1.420317 1.884109
C  -1.917346 2.254625 -0.20569
C  -2.835514 2.315027 0.830931
C  -2.875503 -1.052291 -1.849026
H  -0.566077 -3.545168 -0.071565
H  -1.345254 -3.020477 1.405978
H  3.817996 -1.884742 1.640595
H  2.579536 -0.707314 2.0567
H  4.307306 -2.207257 -0.928721
H  2.402578 1.264696 0.695466
H  4.918736 -0.939928 -2.937212
H  3.008752 2.541226 -1.313511
H  -3.617866 -2.025419 1.024048
H  -0.192942 1.254268 -0.969999
H  -3.495746 1.465195 2.691693
H  -1.963007 2.955141 -1.027784
H  -3.0384 -0.591136 -2.809884
elementType: Cl S N C H
totalener: -2653.53042193 hartree
nucrepener: 2759.05191089 hartree
electener: -5412.58233282 hartree
oneelecener: -9134.14574813 hartree
twoeener: 3721.56341530 hartree
cpcmener: -0.02995993 hartree
kineticenergy: 2647.23957323 hartree
xcener: -168.240108008827 hartree
chargesum: -0.0000000
charge: -0.083222 -0.103073 -0.095988 -0.075158 0.119744 -0.283692 -0.340908 -0.391702 -0.116282 -0.046097 0.173328 0.041596 -0.214987 -0.194962 0.228992 -0.134101 -0.141390 0.069578 -0.079280 -0.258098 0.082703 -0.071361 -0.096135 0.057793 0.060556 0.138928 0.155079 0.158055 0.122199 0.139640 0.141377 0.146145 0.146477 0.171206 0.139435 0.124490 0.146346 0.162770
qa: -0.0832 -0.1031 -0.0960 -0.0752 0.1197 -0.2837 -0.3409 -0.3917 -0.1163 -0.0461 0.1733 0.0416 -0.2150 -0.1950 0.2290 -0.1341 -0.1414 0.0696 -0.0793 -0.2581 0.0827 -0.0714 -0.0961 0.0578 0.0606 0.1389 0.1551 0.1581 0.1222 0.1396 0.1414 0.1461 0.1465 0.1712 0.1394 0.1245 0.1463 0.1628
va: 1.2457 1.2029 1.2081 2.3966 3.3407 2.9875 2.8477 3.0209 3.9049 3.7948 3.9462 3.5446 4.0149 3.9498 3.6591 3.9584 3.9465 4.0564 3.9647 3.9802 3.8297 3.9871 3.9532 3.8573 4.0537 1.0143 0.9958 0.9982 1.0327 1.0089 1.0092 1.0034 1.0043 0.9983 1.0160 1.0190 1.0019 0.9961
dispcorr: -0.024973299 hartree
energy: -2653.555395227767
dipole: 8.22060 -7.20860 1.01200 -11.38244 9.78635 -1.59609 -1.12064 2.46753 1.34688
magnitude: 2.32072 au
magnitude: 5.89880 debye
