program: Orca
programVersion: 4.2.1
elementType: Cl Cl Cl S N N N N C C C C C C C C C C C C C C C C C H H H H H H H H H H H H H
charge: 0
multiplicity: 1
keywords: wb97x-d3
keywords: def2-TZVPP
keywords: def2/J RIJCOSX GRIDX6 NOFINALGRIDX
keywords: grid4 nofinalgrid
keywords: scfconv7
keywords: smallprint printgap noloewdin
keywords: NOSOSCF
formula: C17H13Cl3N4S
InChI: InChI=1/C17H13Cl3N4S/c18-13-3-1-12(2-4-13)9-25-17(8-24-11-21-10-22-24)23-16-6-5-14(19)7-15(16)20/h1-7,10-11H,8-9H2
38 atoms
Cl -2.392231 0.55465 2.565426
Cl 4.89881 1.290836 -2.999091
Cl -2.970434 4.962513 -0.446963
S  0.620861 -2.544731 0.850244
N  -2.154203 -2.797256 0.008849
N  -0.027039 0.00148 0.805344
N  -1.954861 -3.87547 -0.754966
N  -3.05152 -4.42969 1.124244
C  -1.621533 -1.50332 -0.328123
C  2.143487 -1.724761 1.409695
C  -0.384483 -1.162677 0.471933
C  2.837644 -0.973945 0.313278
C  3.299508 -1.637318 -0.820184
C  3.033745 0.399062 0.408437
C  -0.768793 1.132053 0.483736
C  3.935472 -0.950128 -1.841333
C  3.671471 1.103436 -0.602487
C  -2.796689 -3.146837 1.125667
C  -1.865259 1.539413 1.244628
C  -0.368351 1.949492 -0.571388
C  4.112277 0.420295 -1.723269
C  -2.547198 2.713456 0.96959
C  -1.038514 3.122792 -0.866605
C  -2.125562 3.49563 -0.091623
C  -2.511981 -4.821157 -0.046546
H  -2.394978 -0.74981 -0.189144
H  -1.364698 -1.507171 -1.387448
H  2.759744 -2.547281 1.77737
H  1.915936 -1.082998 2.25887
H  3.15803 -2.706611 -0.918795
H  2.682957 0.93484 1.279937
H  4.286918 -1.47873 -2.716791
H  3.812976 2.171848 -0.514059
H  -3.063452 -2.440638 1.896591
H  0.489168 1.657758 -1.16329
H  -3.394806 3.005605 1.573791
H  -0.710996 3.737304 -1.69337
H  -2.538116 -5.841986 -0.392832
elementType: Cl S N C H
totalener: -2653.52999918 hartree
nucrepener: 2692.93462337 hartree
electener: -5346.46462255 hartree
oneelecener: -9000.70926850 hartree
twoeener: 3654.24464595 hartree
cpcmener: -0.02889244 hartree
kineticenergy: 2647.24719900 hartree
xcener: -168.236818601188 hartree
chargesum: -0.0000000
charge: -0.084187 -0.104261 -0.092203 -0.081067 0.087787 -0.291561 -0.340561 -0.408397 -0.108299 -0.029571 0.171517 0.066136 -0.220788 -0.207028 0.174786 -0.134321 -0.144101 0.092316 -0.064007 -0.204715 0.086729 -0.083705 -0.119865 0.062254 0.072940 0.166351 0.148947 0.155783 0.117609 0.136071 0.135060 0.146733 0.145346 0.161153 0.149849 0.128648 0.147232 0.165389
qa: -0.0842 -0.1043 -0.0922 -0.0811 0.0878 -0.2916 -0.3406 -0.4084 -0.1083 -0.0296 0.1715 0.0661 -0.2208 -0.2070 0.1748 -0.1343 -0.1441 0.0923 -0.0640 -0.2047 0.0867 -0.0837 -0.1199 0.0623 0.0729 0.1664 0.1489 0.1558 0.1176 0.1361 0.1351 0.1467 0.1453 0.1612 0.1498 0.1286 0.1472 0.1654
va: 1.2423 1.2013 1.2100 2.3984 3.3300 2.9920 2.8646 3.0390 3.8860 3.8075 3.9337 3.5232 4.0137 3.9378 3.7215 3.9638 3.9338 4.0561 3.9495 3.9991 3.8209 4.0051 3.9902 3.8548 4.0343 0.9845 1.0093 0.9978 1.0348 1.0126 1.0137 1.0034 1.0040 1.0077 0.9999 1.0171 1.0031 0.9939
dispcorr: -0.022454032 hartree
energy: -2653.552453207468
dipole: 6.00169 -5.51572 0.48597 -15.48730 16.06920 0.58189 0.85073 -0.77354 0.07720
magnitude: 0.76205 au
magnitude: 1.93699 debye
