program: Orca
programVersion: 4.2.1
elementType: Cl Cl Cl S N N N N C C C C C C C C C C C C C C C C C H H H H H H H H H H H H H
charge: 0
multiplicity: 1
keywords: wb97x-d3
keywords: def2-TZVPP
keywords: def2/J RIJCOSX GRIDX6 NOFINALGRIDX
keywords: grid4 nofinalgrid
keywords: scfconv7
keywords: smallprint printgap noloewdin
keywords: NOSOSCF
formula: C17H13Cl3N4S
InChI: InChI=1/C17H13Cl3N4S/c18-13-3-1-12(2-4-13)9-25-17(8-24-11-21-10-22-24)23-16-6-5-14(19)7-15(16)20/h1-7,10-11H,8-9H2
38 atoms
Cl -2.003815 0.581125 3.363706
Cl 3.35272 1.084027 -3.795836
Cl -2.777709 4.952932 0.347613
S  0.708298 -2.643022 1.405827
N  -1.709435 -2.528733 -0.35398
N  0.141366 -0.078421 1.346634
N  -2.034811 -3.812859 -0.189263
N  -1.224295 -3.461301 -2.253049
C  -1.727069 -1.585918 0.734696
C  2.353807 -1.876377 1.341204
C  -0.320672 -1.242447 1.177174
C  2.610689 -1.151413 0.052212
C  2.379694 -1.759574 -1.17825
C  3.084176 0.155111 0.070872
C  -0.601291 1.07173 1.106659
C  2.603667 -1.079613 -2.364708
C  3.324685 0.847969 -1.106626
C  -1.211424 -2.340447 -1.577217
C  -1.593744 1.525754 1.975801
C  -0.294426 1.859921 -0.001473
C  3.074731 0.223468 -2.317163
C  -2.263552 2.718695 1.755173
C  -0.960925 3.045816 -0.248065
C  -1.941477 3.467272 0.636913
C  -1.734939 -4.323916 -1.354054
H  -2.286402 -2.030459 1.557173
H  -2.258998 -0.687256 0.423693
H  3.035961 -2.720379 1.463313
H  2.490469 -1.221896 2.19988
H  2.007263 -2.775363 -1.22155
H  3.261046 0.651498 1.01613
H  2.413426 -1.563688 -3.312713
H  3.68817 1.865854 -1.073245
H  -0.873718 -1.379653 -1.934377
H  0.484935 1.529084 -0.675916
H  -3.028619 3.048629 2.444071
H  -0.712896 3.633802 -1.120412
H  -1.89821 -5.368058 -1.56879
elementType: Cl S N C H
totalener: -2653.52866161 hartree
nucrepener: 2754.83069130 hartree
electener: -5408.35935291 hartree
oneelecener: -9124.42686157 hartree
twoeener: 3716.06750866 hartree
cpcmener: -0.02729836 hartree
kineticenergy: 2647.24937074 hartree
xcener: -168.237350297167 hartree
chargesum: 0.0000000
charge: -0.077193 -0.104305 -0.090477 -0.081330 0.088840 -0.262862 -0.340637 -0.404459 -0.070800 -0.038992 0.111448 0.112399 -0.255172 -0.214734 0.154132 -0.126652 -0.157345 0.077888 -0.031899 -0.160374 0.106545 -0.100021 -0.153654 0.081931 0.068477 0.143199 0.163986 0.152505 0.113485 0.134960 0.133839 0.145636 0.145830 0.167114 0.131030 0.127800 0.144319 0.165545
qa: -0.0772 -0.1043 -0.0905 -0.0813 0.0888 -0.2629 -0.3406 -0.4045 -0.0708 -0.0390 0.1114 0.1124 -0.2552 -0.2147 0.1541 -0.1267 -0.1573 0.0779 -0.0319 -0.1604 0.1065 -0.1000 -0.1537 0.0819 0.0685 0.1432 0.1640 0.1525 0.1135 0.1350 0.1338 0.1456 0.1458 0.1671 0.1310 0.1278 0.1443 0.1655
va: 1.2487 1.2003 1.2117 2.3848 3.3832 3.0147 2.8645 3.0084 3.8506 3.8316 3.9767 3.5172 3.9773 3.9400 3.7615 3.9519 3.9268 4.0529 3.9762 3.9668 3.7956 4.0234 4.0479 3.8391 4.0398 1.0121 0.9907 0.9974 1.0336 1.0189 1.0090 1.0042 1.0046 0.9966 1.0095 1.0173 1.0057 0.9933
dispcorr: -0.024613803 hartree
energy: -2653.553275413399
dipole: 7.95548 -7.50696 0.44852 -15.42655 15.88266 0.45611 -1.71328 2.51508 0.80180
magnitude: 1.02572 au
magnitude: 2.60717 debye
