program: Orca
programVersion: 4.2.1
elementType: Cl Cl Cl S N N N N C C C C C C C C C C C C C C C C C H H H H H H H H H H H H H
charge: 0
multiplicity: 1
keywords: wb97x-d3
keywords: def2-TZVPP
keywords: def2/J RIJCOSX GRIDX6 NOFINALGRIDX
keywords: grid4 nofinalgrid
keywords: scfconv7
keywords: smallprint printgap noloewdin
keywords: NOSOSCF
formula: C17H13Cl3N4S
InChI: InChI=1/C17H13Cl3N4S/c18-13-3-1-12(2-4-13)9-25-17(8-24-11-21-10-22-24)23-16-6-5-14(19)7-15(16)20/h1-7,10-11H,8-9H2
38 atoms
Cl -0.514667 0.004686 1.934366
Cl 3.834753 3.520896 0.597812
Cl 0.003101 4.173097 -1.404317
S  0.805219 -2.810511 -0.434598
N  -2.7604 -3.429966 0.993387
N  -1.590641 -1.418159 -0.440921
N  -2.591611 -3.300332 2.310712
N  -4.680052 -2.744845 1.724993
C  -1.648176 -3.723978 0.139648
C  1.520683 -1.588576 -1.568852
C  -0.911297 -2.459668 -0.266369
C  2.079727 -0.326175 -0.973474
C  2.25249 0.771908 -1.811197
C  2.490863 -0.224608 0.349167
C  -1.14528 -0.131639 -0.687259
C  2.804649 1.952474 -1.342953
C  3.033248 0.953709 0.838062
C  -4.002683 -3.079699 0.655061
C  -0.662142 0.669739 0.34942
C  -1.304213 0.450338 -1.943288
C  3.18001 2.03642 -0.012669
C  -0.317427 1.994428 0.140416
C  -0.954383 1.7681 -2.172785
C  -0.460529 2.530118 -1.126069
C  -3.768764 -2.89602 2.707471
H  -2.002797 -4.221338 -0.764307
H  -0.993373 -4.426313 0.65502
H  0.803447 -1.374272 -2.35984
H  2.326621 -2.153556 -2.045628
H  1.948952 0.713232 -2.849201
H  2.371584 -1.060186 1.026343
H  2.922186 2.798302 -2.005997
H  3.331473 1.022187 1.875471
H  -4.361609 -3.095964 -0.361816
H  -1.707012 -0.146484 -2.751324
H  0.063096 2.592448 0.956454
H  -1.069268 2.19187 -3.160934
H  -3.984382 -2.706633 3.747615
elementType: Cl S N C H
totalener: -2653.53631217 hartree
nucrepener: 2855.45782997 hartree
electener: -5508.99414214 hartree
oneelecener: -9326.85134428 hartree
twoeener: 3817.85720215 hartree
cpcmener: -0.03045272 hartree
kineticenergy: 2647.23832326 hartree
xcener: -168.243614692008 hartree
chargesum: -0.0000000
charge: -0.080042 -0.101382 -0.097060 -0.076847 0.096975 -0.283181 -0.337974 -0.414948 -0.030658 -0.026077 0.130650 0.065858 -0.204105 -0.233492 0.177179 -0.166304 -0.110082 0.069053 -0.019641 -0.238704 0.104731 -0.090726 -0.104571 0.075364 0.061279 0.140947 0.130208 0.128191 0.158344 0.137211 0.121974 0.136357 0.138405 0.174469 0.147385 0.120162 0.141143 0.159908
qa: -0.0800 -0.1014 -0.0971 -0.0768 0.0970 -0.2832 -0.3380 -0.4149 -0.0307 -0.0261 0.1306 0.0659 -0.2041 -0.2335 0.1772 -0.1663 -0.1101 0.0691 -0.0196 -0.2387 0.1047 -0.0907 -0.1046 0.0754 0.0613 0.1409 0.1302 0.1282 0.1583 0.1372 0.1220 0.1364 0.1384 0.1745 0.1474 0.1202 0.1411 0.1599
va: 1.2453 1.2055 1.2088 2.4032 3.3868 3.0241 2.8876 3.0214 3.8129 3.8274 4.0214 3.5893 3.9356 3.9248 3.7033 3.9034 3.9555 4.0704 3.9800 3.9810 3.7768 3.9269 3.9392 3.7945 4.0582 0.9999 1.0175 1.0154 0.9910 1.0029 1.0364 1.0169 1.0079 0.9951 1.0087 1.0184 1.0045 0.9951
dispcorr: -0.028197048 hartree
energy: -2653.564509215426
dipole: -5.01081 5.98306 0.97225 -19.66087 18.02142 -1.63945 -9.04562 6.29229 -2.75333
magnitude: 3.34872 au
magnitude: 8.51176 debye
