program: Orca
programVersion: 4.2.1
elementType: Cl Cl Cl S N N N N C C C C C C C C C C C C C C C C C H H H H H H H H H H H H H
charge: 0
multiplicity: 1
keywords: wb97x-d3
keywords: def2-TZVPP
keywords: def2/J RIJCOSX GRIDX6 NOFINALGRIDX
keywords: grid4 nofinalgrid
keywords: scfconv7
keywords: smallprint printgap noloewdin
keywords: NOSOSCF
formula: C17H13Cl3N4S
InChI: InChI=1/C17H13Cl3N4S/c18-13-3-1-12(2-4-13)9-25-17(8-24-11-21-10-22-24)23-16-6-5-14(19)7-15(16)20/h1-7,10-11H,8-9H2
38 atoms
Cl -1.451216 -0.243455 3.447612
Cl 3.938033 1.558599 -3.826787
Cl -3.977053 3.491121 0.530406
S  1.733671 -2.702736 1.189382
N  -1.860995 -2.01922 -0.121674
N  0.362857 -0.474547 1.048674
N  -1.497673 -1.864106 -1.395877
N  -3.571893 -1.086706 -1.066497
C  -0.95063 -2.584252 0.833591
C  3.01419 -1.422717 1.312506
C  0.290008 -1.730689 1.011221
C  3.239218 -0.681745 0.027578
C  3.05771 0.694979 -0.035781
C  3.64588 -1.353898 -1.121135
C  -0.704365 0.401532 0.928581
C  3.276262 1.393331 -1.214089
C  3.862968 -0.674052 -2.308875
C  -3.098351 -1.548525 0.062688
C  -1.593755 0.653527 1.97421
C  -0.842558 1.155574 -0.236849
C  3.673765 0.699077 -2.344578
C  -2.597276 1.602648 1.865324
C  -1.846883 2.094964 -0.371238
C  -2.719402 2.311344 0.683635
C  -2.553085 -1.299897 -1.923952
H  -0.680799 -3.591603 0.514656
H  -1.462759 -2.679916 1.791848
H  3.90932 -1.972167 1.611126
H  2.760725 -0.746905 2.128548
H  2.735384 1.237925 0.842994
H  3.791779 -2.42736 -1.101664
H  3.128582 2.464482 -1.244973
H  4.17488 -1.212423 -3.193743
H  -3.600785 -1.571665 1.017387
H  -0.1485 0.989294 -1.049754
H  -3.274942 1.775026 2.690252
H  -1.941351 2.653983 -1.291996
H  -2.593354 -1.035656 -2.969213
elementType: Cl S N C H
totalener: -2653.54150727 hartree
nucrepener: 2780.30644416 hartree
electener: -5433.84795143 hartree
oneelecener: -9176.64037306 hartree
twoeener: 3742.79242163 hartree
cpcmener: -0.02574058 hartree
kineticenergy: 2647.21813749 hartree
xcener: -168.235952470275 hartree
chargesum: -0.0000000
charge: -0.081007 -0.102477 -0.094030 -0.070119 0.120724 -0.276408 -0.335668 -0.385881 -0.112440 -0.045443 0.168433 0.076595 -0.204488 -0.220861 0.227172 -0.133965 -0.129214 0.071145 -0.095908 -0.223422 0.077255 -0.080980 -0.127266 0.079774 0.058304 0.131720 0.149815 0.153272 0.118128 0.130348 0.133168 0.143026 0.143965 0.169303 0.140185 0.124287 0.142705 0.160250
qa: -0.0810 -0.1025 -0.0940 -0.0701 0.1207 -0.2764 -0.3357 -0.3859 -0.1124 -0.0454 0.1684 0.0766 -0.2045 -0.2209 0.2272 -0.1340 -0.1292 0.0711 -0.0959 -0.2234 0.0773 -0.0810 -0.1273 0.0798 0.0583 0.1317 0.1498 0.1533 0.1181 0.1303 0.1332 0.1430 0.1440 0.1693 0.1402 0.1243 0.1427 0.1603
va: 1.2463 1.2031 1.2090 2.4031 3.3333 2.9990 2.8559 3.0208 3.9153 3.8150 3.9523 3.5433 3.9545 4.0225 3.6441 3.9380 3.9647 4.0525 3.9585 3.9327 3.8427 3.9912 4.0009 3.8457 4.0563 1.0148 1.0012 0.9981 1.0332 1.0138 1.0131 1.0044 1.0041 0.9929 1.0137 1.0184 1.0042 0.9967
dispcorr: -0.025453322 hartree
energy: -2653.566960592128
dipole: 8.22176 -7.39206 0.82970 -12.09893 10.70401 -1.39492 -0.71137 2.16366 1.45229
magnitude: 2.17792 au
magnitude: 5.53584 debye
