program: Gaussian 09
title: 000063443
version: EM64L-G09RevD.01
frameworkgroup: C1[X(C22H29N3O)]
method: RPBEPBE
basis: SDD
operation: Freq
keyword: #p
keyword: freq=noraman
keyword: PBEPBE/SDD
title: #p freq=noraman PBEPBE/SDD
converged: YES YES NO NO
title: Mulliken charges:
elementType: O N N N C C C C C C C C C C C C C C C C C C C C C C H H H H H H H H H H H H H H H H H H H H H H H H H H H H H
charge: -0.255349 -0.166702 -0.296854 -0.101883 -0.138603 -0.449522 0.338762 -0.376359 0.076136 -0.675870 0.107389 0.304021 -0.359780 -0.320935 -0.328271 -0.335804 0.289304 -0.326348 -0.231253 -0.273156 -0.672249 -0.674196 -0.359541 -0.832634 -0.243518 -0.243469 0.245727 0.218367 0.234439 0.218963 0.233954 0.238871 0.221990 0.240337 0.228631 0.196063 0.198331 0.192823 0.205658 0.272335 0.264372 0.222733 0.230564 0.225636 0.209740 0.208952 0.227473 0.207124 0.211868 0.230742 0.234526 0.255481 0.215793 0.228446 0.226747
chargesum: 0.00000
title: Mulliken charges with hydrogens summed into heavy atoms:
elementType: O N N N C C C C C C C C C C C C C C C C C C C C C C
charge: -0.255349 -0.166702 -0.296854 -0.101883 0.107124 0.003283 0.338762 0.076558 0.076136 0.025327 0.107389 0.304021 -0.131149 0.073459 0.070210 -0.063469 0.289304 -0.061976 -0.008520 -0.042592 -0.027921 -0.027732 -0.128798 -0.126834 -0.015073 -0.016722
polarizability: 3.25329032e+02 2.64250674e+01 3.10790626e+02 -2.10729776e+00 -7.27831707e+00 1.73070100e+02
1716.lowfreq: -9.5893 -4.7116 -0.0007 -0.0005 -0.0004 5.0661 18.6893 24.0661 25.6328
frequency: 18.5816 24.0086 25.4809 41.1646 48.8077 59.9380 70.4981 79.7187 87.3083 91.0064 127.0930 137.4332 151.4596 166.0457 173.5934 184.3167 215.0478 222.2080 229.9592 248.9710 259.9674 275.6623 283.8711 290.9860 307.3895 318.1645 356.2933 374.0377 392.9581 419.7258 428.9227 439.9067 448.7940 470.0772 478.2990 507.0943 512.7094 527.4010 552.8705 563.9339 576.4789 625.5494 658.2502 679.5812 707.0417 722.7535 740.7664 755.7308 761.7901 766.3224 771.6603 775.6519 788.4777 797.0662 802.9230 849.4148 851.4058 866.8312 892.2174 915.4272 944.8186 958.5014 981.3530 984.8511 986.1674 986.4089 990.8421 1022.6740 1029.7754 1040.4782 1044.4434 1046.5939 1062.7907 1069.9946 1073.9361 1075.7517 1084.1560 1091.2619 1108.6602 1113.8572 1131.4198 1149.0224 1164.0979 1173.5185 1177.3410 1200.0051 1203.0406 1210.0757 1232.9983 1247.0678 1259.6502 1280.9598 1283.6725 1288.5026 1290.5929 1298.5205 1321.7106 1323.4397 1362.0046 1363.4257 1371.6256 1374.3205 1376.2033 1378.4535 1385.6965 1386.5516 1387.8124 1394.6135 1404.0838 1433.6356 1455.4159 1461.4202 1462.7447 1465.8201 1467.0324 1468.1733 1470.2605 1475.6362 1478.5849 1482.9516 1485.9633 1486.8807 1489.2278 1490.7930 1501.5640 1563.3258 1581.6101 1586.5271 1611.9159 1624.4403 2859.1677 2867.0942 2907.3204 2958.0710 2977.2592 2978.6095 2984.0028 2985.5047 3016.8130 3032.2490 3045.4444 3045.8502 3049.9935 3068.2961 3071.4629 3076.8401 3083.2321 3090.1329 3090.2366 3091.8722 3099.3046 3118.4945 3126.8129 3135.9489 3146.1575 3155.3319 3156.5774 3169.9542 3174.4333
redmass: 3.3077 4.2084 4.0616 4.5331 3.8743 3.1124 3.1372 3.3009 3.7078 2.3243 3.5401 4.2315 1.6591 1.0566 2.6716 2.4547 1.6034 3.5929 2.0000 1.9466 1.2058 3.3019 2.6483 2.5732 3.8558 2.6920 3.9658 3.3831 3.0933 4.0019 3.4330 2.9113 2.8899 3.0794 4.9216 4.1153 3.8258 3.8919 4.9617 4.4973 4.8949 4.4094 5.8319 4.0570 4.1622 2.6182 2.7503 1.8382 1.5874 2.4552 2.5028 1.2930 1.9183 1.2017 1.7464 2.4567 1.8215 1.4670 2.5534 1.9684 1.3820 1.3591 1.5686 1.5439 1.7558 1.4364 2.4043 3.4365 3.6842 1.9976 1.5675 2.0146 2.7305 2.0542 2.5866 1.9405 2.1578 2.1696 1.9343 1.9140 1.9953 1.9155 2.0375 1.0551 1.3011 2.6326 2.2791 2.2631 2.6955 2.0321 1.6568 1.1937 1.4864 1.6677 1.2703 1.1919 1.3853 1.3654 1.3340 1.3356 4.9957 2.1141 1.4729 1.4112 1.2682 1.2382 2.5431 1.2329 2.1462 2.1672 2.2613 1.0905 1.0588 1.1093 1.1358 1.0964 1.0590 1.1374 1.0987 1.1257 1.0743 1.7563 1.5967 1.1091 1.6129 8.4958 8.1006 6.5165 6.5239 7.0005 1.0718 1.0712 1.0705 1.0442 1.0657 1.0364 1.0358 1.0352 1.0875 1.0877 1.0878 1.0878 1.0871 1.0977 1.0974 1.0984 1.0999 1.1003 1.1001 1.1004 1.1006 1.0871 1.0860 1.0896 1.0887 1.0959 1.0937 1.1000 1.0979
irintensity: 0.2700 0.1470 0.7621 0.4979 0.5843 0.5420 0.1155 0.6260 1.8799 0.2047 0.0586 1.4876 0.8004 0.0641 0.3979 2.5392 0.5951 1.8470 1.3316 0.8953 0.7875 1.5914 4.6670 0.5041 5.8534 1.6574 4.0123 4.5941 1.0295 8.2478 5.9145 2.2255 6.7831 10.4185 4.7036 6.1861 2.6256 6.9290 2.7176 5.1401 6.9255 7.9906 1.3900 9.2937 10.5364 12.7899 2.4782 77.7034 61.1538 7.0282 9.1621 7.0030 2.5928 5.4982 4.2538 3.7113 1.8983 3.7072 1.4602 2.9843 0.6049 2.4487 4.0767 3.7697 6.9674 1.7754 0.7343 17.7072 4.2050 15.8248 10.8949 7.8088 6.3933 9.8693 29.5990 39.0602 3.2004 10.6187 36.4898 62.1264 16.6711 11.0825 11.7490 0.3568 30.6644 3.4423 5.3603 71.8523 27.9633 91.2292 37.1035 7.9324 2.8293 14.4328 30.8421 19.6354 51.3576 22.0711 0.7372 2.9016 23.8110 85.3549 39.9042 39.4000 31.1263 17.6305 24.5967 13.7243 60.6177 12.5107 73.6821 7.6294 5.6310 7.0367 4.6908 28.8084 1.5908 4.5511 16.1393 10.6509 3.6092 43.2148 91.1526 23.0473 86.7720 43.8313 163.2140 15.4330 25.9322 185.3874 30.3210 149.1456 71.2912 41.7438 41.7526 29.7926 33.4398 18.5887 29.5322 16.0028 13.8634 18.9759 5.4921 44.3251 66.4062 60.0442 21.5607 19.1458 24.2829 48.0664 24.8119 7.2327 6.7200 13.8420 6.7526 39.8634 24.0482 27.2687 7.6895
temp: 298.150 k
press: 1.00000 atm
elementType: 8 7 7 7 6 6 6 6 6 6 6 6 6 6 6 6 6 6 6 6 6 6 6 6 6 6 1 1 1 1 1 1 1 1 1 1 1 1 1 1 1 1 1 1 1 1 1 1 1 1 1 1 1 1 1
symmnumber: 1
zpe: 1221035.4 jmol-1
zpe.correction: 0.465068 hartree
zpe.thermalcorrener: 0.491224 hartree
zpe.thermalcorrenthalpy: 0.492168 hartree
zpe.thermalcorrgfe: 0.407038 hartree
zpe.sumelectzpe: -1093.282581 hartree
zpe.sumelectthermal: -1093.256425 hartree
zpe.sumelectthermalent: -1093.255481 hartree
zpe.sumelectthermalfe: -1093.340611 hartree
dipole: 4.4714 -2.9918 1.8589
dipole: 5.6921
quadrupole: -152.5712 -150.1748 -159.2729
quadrupole: 10.0860 -9.7181 5.2735
quadrupole: 1.4351 3.8315 -5.2666 10.0860 -9.7181 5.2735
hfenergy: -1093.7476486 hartree
pointgroup: C01 [X(C22H29N3O1)]
dipole: 1.6345291 -1.4114292 0.592698 debye
polarizability: 330.0965354|24.6661646|305.856217|1.9322718|8.5829616|173.2370055 unknown
InChI: InChI=1S/C22H29N3O/c1-5-23(6-2)15-16-24-18(4)25(20-13-9-7-11-17(20)3)22(26)19-12-8-10-14-21(19)24/h7-14,18H,5-6,15-16H2,1-4H3
charge 0 multiplicity 1
55 atoms
O  -2.765753 2.24488 -0.6722
N  0.73043 0.421475 0.615753
N  -1.661497 0.353697 0.17704
N  3.837604 -1.629316 -0.214737
C  -0.56584 -0.118971 1.071255
C  1.940813 -0.390586 0.834978
C  0.781739 1.78592 0.31155
C  2.617154 -0.833738 -0.488821
C  -0.444576 2.467514 0.005833
C  -0.863766 0.237747 2.550824
C  -1.723575 1.719046 -0.17097
C  -2.789868 -0.530399 -0.022566
C  2.000493 2.526177 0.273454
C  5.051765 -0.78381 -0.046425
C  4.037834 -2.763264 -1.156529
C  -0.432462 3.854345 -0.274932
C  -2.623679 -1.737253 -0.763972
C  -4.051501 -0.188258 0.523883
C  1.985047 3.905615 -0.007565
C  0.769582 4.586121 -0.27241
C  6.119018 -1.431918 0.855813
C  3.060137 -3.928137 -0.91014
C  -3.746494 -2.593474 -0.901043
C  -1.303608 -2.099587 -1.421829
C  -5.155542 -1.049274 0.36346
C  -5.000452 -2.264239 -0.343433
H  -0.522246 -1.216403 0.97318
H  2.670919 0.151948 1.468923
H  1.66584 -1.299596 1.397568
H  1.895143 -1.449578 -1.053214
H  2.827547 0.061813 -1.119426
H  -1.8394 -0.182232 2.853403
H  -0.082495 -0.180278 3.211531
H  -0.891755 1.332496 2.688246
H  2.955471 2.032663 0.476271
H  5.50099 -0.517708 -1.036528
H  4.736404 0.171409 0.415311
H  3.966791 -2.428091 -2.222169
H  5.068194 -3.136966 -1.014737
H  -1.391184 4.322546 -0.522147
H  -4.159406 0.763719 1.050813
H  2.932623 4.457031 -0.017964
H  0.769765 5.658782 -0.489083
H  5.694923 -1.645257 1.852405
H  6.491968 -2.383244 0.435356
H  6.987002 -0.756783 0.974479
H  3.161743 -4.296086 0.125772
H  2.00762 -3.625096 -1.064849
H  3.269899 -4.761942 -1.605772
H  -3.632966 -3.522843 -1.472692
H  -1.476903 -2.665755 -2.353371
H  -0.72058 -1.193976 -1.66364
H  -0.675192 -2.73911 -0.768171
H  -6.128481 -0.773491 0.78432
H  -5.852438 -2.941085 -0.471887
