program: Orca
programVersion: 4.2.1
elementType: Cl Cl Cl S N N N N C C C C C C C C C C C C C C C C C H H H H H H H H H H H H H
charge: 0
multiplicity: 1
keywords: wb97x-d3
keywords: def2-TZVPP
keywords: def2/J RIJCOSX GRIDX6 NOFINALGRIDX
keywords: grid4 nofinalgrid
keywords: scfconv7
keywords: smallprint printgap noloewdin
keywords: NOSOSCF
formula: C17H13Cl3N4S
InChI: InChI=1/C17H13Cl3N4S/c18-13-3-1-12(2-4-13)9-25-17(8-24-11-21-10-22-24)23-16-6-5-14(19)7-15(16)20/h1-7,10-11H,8-9H2
38 atoms
Cl 0.638058 1.346825 1.292122
Cl 4.888992 2.505862 0.282196
Cl -3.303671 4.374456 -0.750496
S  0.703633 -2.994212 0.126929
N  -2.392592 -2.631473 1.070684
N  -0.31268 -0.707313 -0.652847
N  -3.256094 -2.384068 0.085532
N  -3.650262 -4.391807 0.993893
C  -1.344605 -1.690185 1.37539
C  1.839262 -2.460741 -1.188986
C  -0.375233 -1.618807 0.213643
C  2.619844 -1.231335 -0.827904
C  2.542295 -0.092019 -1.619971
C  3.425906 -1.201029 0.30515
C  -1.063547 0.457485 -0.606588
C  3.244723 1.057302 -1.294008
C  4.130171 -0.059032 0.650955
C  -2.633557 -3.832497 1.602168
C  -0.69468 1.528804 0.209078
C  -2.150074 0.62837 -1.461653
C  4.027696 1.065197 -0.152719
C  -1.37615 2.735489 0.17178
C  -2.845107 1.82266 -1.508622
C  -2.448976 2.870487 -0.691743
C  -3.992756 -3.464224 0.078581
H  -0.841058 -2.016914 2.284302
H  -1.788391 -0.715106 1.572096
H  1.275315 -2.321429 -2.110819
H  2.494928 -3.321943 -1.335358
H  1.914047 -0.090893 -2.501088
H  3.502329 -2.074201 0.94183
H  3.16504 1.93766 -1.917097
H  4.748246 -0.049009 1.538546
H  -2.05638 -4.243302 2.415825
H  -2.447824 -0.193323 -2.09856
H  -1.071251 3.552394 0.811101
H  -3.687058 1.929924 -2.178266
H  -4.810696 -3.589665 -0.613923
elementType: Cl S N C H
totalener: -2653.54169962 hartree
nucrepener: 2756.79658878 hartree
electener: -5410.33828840 hartree
oneelecener: -9129.57183433 hartree
twoeener: 3719.23354593 hartree
cpcmener: -0.02620077 hartree
kineticenergy: 2647.24059993 hartree
xcener: -168.235793888068 hartree
chargesum: -0.0000000
charge: -0.082187 -0.105887 -0.093334 -0.078045 0.121318 -0.254596 -0.357798 -0.411447 -0.096321 -0.047236 0.120886 0.098704 -0.201993 -0.236548 0.225307 -0.131575 -0.123843 0.074164 -0.074465 -0.244032 0.076593 -0.072493 -0.088865 0.052138 0.084564 0.144542 0.146097 0.119039 0.152332 0.128440 0.130645 0.139793 0.142197 0.178674 0.131783 0.126757 0.144841 0.161851
qa: -0.0822 -0.1059 -0.0933 -0.0780 0.1213 -0.2546 -0.3578 -0.4114 -0.0963 -0.0472 0.1209 0.0987 -0.2020 -0.2365 0.2253 -0.1316 -0.1238 0.0742 -0.0745 -0.2440 0.0766 -0.0725 -0.0889 0.0521 0.0846 0.1445 0.1461 0.1190 0.1523 0.1284 0.1306 0.1398 0.1422 0.1787 0.1318 0.1268 0.1448 0.1619
va: 1.2404 1.1979 1.2098 2.3933 3.3339 2.9422 2.8513 3.0285 3.9104 3.8298 3.9821 3.5019 3.9514 4.0313 3.6197 3.9432 3.9494 4.0403 3.9985 4.0361 3.8155 3.9823 3.9599 3.8737 4.0239 1.0097 1.0030 1.0303 0.9990 1.0143 1.0146 1.0048 1.0040 0.9914 1.0273 1.0187 1.0029 0.9934
dispcorr: -0.024072176 hartree
energy: -2653.565771794167
dipole: -2.72546 3.23939 0.51393 -21.53251 20.54196 -0.99055 -3.97700 4.23012 0.25312
magnitude: 1.14428 au
magnitude: 2.90854 debye
