program: Orca
programVersion: 4.2.1
elementType: Cl Cl Cl S N N N N C C C C C C C C C C C C C C C C C H H H H H H H H H H H H H
charge: 0
multiplicity: 1
keywords: wb97x-d3
keywords: def2-TZVPP
keywords: def2/J RIJCOSX GRIDX6 NOFINALGRIDX
keywords: grid4 nofinalgrid
keywords: scfconv7
keywords: smallprint printgap noloewdin
keywords: NOSOSCF
formula: C17H13Cl3N4S
InChI: InChI=1/C17H13Cl3N4S/c18-13-3-1-12(2-4-13)9-25-17(8-24-11-21-10-22-24)23-16-6-5-14(19)7-15(16)20/h1-7,10-11H,8-9H2
38 atoms
Cl -1.735514 -0.307982 -3.909383
Cl 3.334554 2.04511 3.163284
Cl -3.626249 4.118053 -1.522592
S  0.840099 -3.000896 -0.677803
N  -1.032967 -2.070887 1.652382
N  -0.277063 -0.735755 -1.398747
N  -0.543814 -0.962795 2.21143
N  -0.289295 -2.709966 3.583956
C  -1.525699 -2.055347 0.2996
C  2.304846 -2.01801 -1.138252
C  -0.396435 -1.750248 -0.66198
C  2.614825 -0.997652 -0.086792
C  2.456805 0.359323 -0.34139
C  3.01998 -1.396735 1.184551
C  -1.123997 0.362554 -1.371789
C  2.68197 1.303512 0.650887
C  3.253057 -0.469371 2.184143
C  -0.862744 -3.108743 2.475502
C  -1.826611 0.718247 -2.524745
C  -1.212631 1.205968 -0.264975
C  3.071302 0.877787 1.908474
C  -2.602851 1.862765 -2.579474
C  -1.977535 2.35939 -0.304142
C  -2.668074 2.678612 -1.461561
C  -0.11222 -1.390688 3.368607
H  -2.331048 -1.328216 0.20572
H  -1.945979 -3.0374 0.0781
H  2.145024 -1.568131 -2.116493
H  3.102816 -2.755929 -1.237855
H  2.147916 0.691884 -1.323691
H  3.143611 -2.449454 1.408428
H  2.546734 2.355771 0.440194
H  3.563533 -0.79475 3.167835
H  -1.173456 -4.112528 2.231365
H  -0.669226 0.949611 0.635194
H  -3.144816 2.111479 -3.48153
H  -2.030813 2.999364 0.56585
H  0.346496 -0.728168 4.08587
elementType: Cl S N C H
totalener: -2653.54099105 hartree
nucrepener: 2774.59008996 hartree
electener: -5428.13108101 hartree
oneelecener: -9164.97774665 hartree
twoeener: 3736.84666564 hartree
cpcmener: -0.02473313 hartree
kineticenergy: 2647.22280903 hartree
xcener: -168.232388832703 hartree
chargesum: -0.0000000
charge: -0.077092 -0.105513 -0.092369 -0.096105 0.134519 -0.285702 -0.345208 -0.403130 -0.115454 -0.054124 0.178391 0.055794 -0.189979 -0.210834 0.223133 -0.143327 -0.145428 0.068598 -0.082550 -0.239037 0.105226 -0.077983 -0.111986 0.056977 0.083803 0.147771 0.147901 0.119329 0.150793 0.142198 0.128748 0.140385 0.141801 0.176304 0.159519 0.123538 0.143320 0.147775
qa: -0.0771 -0.1055 -0.0924 -0.0961 0.1345 -0.2857 -0.3452 -0.4031 -0.1155 -0.0541 0.1784 0.0558 -0.1900 -0.2108 0.2231 -0.1433 -0.1454 0.0686 -0.0825 -0.2390 0.1052 -0.0780 -0.1120 0.0570 0.0838 0.1478 0.1479 0.1193 0.1508 0.1422 0.1287 0.1404 0.1418 0.1763 0.1595 0.1235 0.1433 0.1478
va: 1.2496 1.2008 1.2105 2.3381 3.3081 2.9398 2.8358 3.0265 3.9386 3.8244 3.9204 3.5516 3.9411 3.9804 3.6045 3.9513 3.9298 4.0494 4.0014 3.9597 3.8076 3.9777 4.0163 3.8570 4.0321 0.9942 1.0013 1.0344 0.9985 1.0085 1.0146 1.0061 1.0043 0.9927 1.0287 1.0211 1.0056 1.0000
dispcorr: -0.025479884 hartree
energy: -2653.566470936669
dipole: 8.19227 -8.49670 -0.30442 -14.90839 13.46391 -1.44449 7.40317 -8.12015 -0.71698
magnitude: 1.64112 au
magnitude: 4.17140 debye
