program: Orca
programVersion: 4.2.1
elementType: Cl Cl Cl S N N N N C C C C C C C C C C C C C C C C C H H H H H H H H H H H H H
charge: 0
multiplicity: 1
keywords: wb97x-d3
keywords: def2-TZVPP
keywords: def2/J RIJCOSX GRIDX6 NOFINALGRIDX
keywords: grid4 nofinalgrid
keywords: scfconv7
keywords: smallprint printgap noloewdin
keywords: NOSOSCF
formula: C17H13Cl3N4S
InChI: InChI=1/C17H13Cl3N4S/c18-13-3-1-12(2-4-13)9-25-17(8-24-11-21-10-22-24)23-16-6-5-14(19)7-15(16)20/h1-7,10-11H,8-9H2
38 atoms
Cl -1.706832 0.754431 3.219652
Cl 2.206627 1.469209 -3.893091
Cl -0.396338 4.998706 0.211464
S  0.813244 -1.156376 2.264719
N  -1.646379 -3.48896 0.095633
N  -1.332001 -0.811452 0.634263
N  -0.983588 -3.866361 -0.999991
N  -3.183338 -3.784771 -1.401854
C  -0.936271 -3.081979 1.273659
C  2.120208 -1.793719 1.144907
C  -0.597243 -1.611067 1.266567
C  2.187626 -1.004586 -0.123564
C  2.721484 0.281703 -0.127015
C  1.671054 -1.518123 -1.307253
C  -1.105098 0.559992 0.586391
C  2.741153 1.042843 -1.281651
C  1.686376 -0.768955 -2.476382
C  -2.954087 -3.430347 -0.161117
C  -1.239981 1.403706 1.688056
C  -0.788264 1.131534 -0.64227
C  2.217217 0.508672 -2.449879
C  -1.034439 2.769983 1.579253
C  -0.558174 2.487753 -0.767998
C  -0.679937 3.297803 0.349781
C  -1.944891 -4.039679 -1.868903
H  -0.044289 -3.697852 1.368692
H  -1.546848 -3.282982 2.156369
H  1.966683 -2.856627 0.956587
H  3.038079 -1.703105 1.727463
H  3.119439 0.70525 0.787096
H  1.237291 -2.510893 -1.327418
H  3.152195 2.043077 -1.267853
H  1.276519 -1.17889 -3.389703
H  -3.686383 -3.137144 0.574602
H  -0.711059 0.488936 -1.508552
H  -1.142081 3.406785 2.446505
H  -0.291632 2.904649 -1.729166
H  -1.747111 -4.369204 -2.877186
elementType: Cl S N C H
totalener: -2653.53801540 hartree
nucrepener: 2819.94397476 hartree
electener: -5473.48199017 hartree
oneelecener: -9255.59493462 hartree
twoeener: 3782.11294445 hartree
cpcmener: -0.02589571 hartree
kineticenergy: 2647.23429727 hartree
xcener: -168.230116773175 hartree
chargesum: -0.0000000
charge: -0.074457 -0.099942 -0.088492 -0.104028 0.134368 -0.227824 -0.374105 -0.413236 -0.069236 -0.119043 0.089662 0.034181 -0.168449 -0.131649 0.247154 -0.139785 -0.200120 0.068283 -0.069931 -0.217119 0.110977 -0.087173 -0.114744 0.058617 0.083734 0.139380 0.142664 0.134060 0.151188 0.131621 0.146156 0.138562 0.140490 0.175426 0.150993 0.126381 0.135101 0.160333
qa: -0.0745 -0.0999 -0.0885 -0.1040 0.1344 -0.2278 -0.3741 -0.4132 -0.0692 -0.1190 0.0897 0.0342 -0.1684 -0.1316 0.2472 -0.1398 -0.2001 0.0683 -0.0699 -0.2171 0.1110 -0.0872 -0.1147 0.0586 0.0837 0.1394 0.1427 0.1341 0.1512 0.1316 0.1462 0.1386 0.1405 0.1754 0.1510 0.1264 0.1351 0.1603
va: 1.2474 1.2050 1.2163 2.2559 3.3189 2.9822 2.8416 3.0251 3.8826 3.8949 4.0216 3.5541 3.9692 3.8580 3.6942 3.9163 4.0012 4.0672 4.0123 3.9797 3.7739 4.0057 3.9425 3.8909 4.0179 1.0021 1.0006 1.0083 0.9956 1.0072 1.0268 1.0067 1.0093 0.9939 1.0034 1.0166 1.0132 0.9939
dispcorr: -0.026170111 hartree
energy: -2653.564185516136
dipole: 4.60059 -3.40837 1.19222 -21.96144 20.91531 -1.04612 -1.22741 2.73835 1.51094
magnitude: 2.19059 au
magnitude: 5.56804 debye
