program: Orca
programVersion: 4.2.1
elementType: Cl Cl Cl S N N N N C C C C C C C C C C C C C C C C C H H H H H H H H H H H H H
charge: 0
multiplicity: 1
keywords: wb97x-d3
keywords: def2-TZVPP
keywords: def2/J RIJCOSX GRIDX6 NOFINALGRIDX
keywords: grid4 nofinalgrid
keywords: scfconv7
keywords: smallprint printgap noloewdin
keywords: NOSOSCF
formula: C17H13Cl3N4S
InChI: InChI=1/C17H13Cl3N4S/c18-13-3-1-12(2-4-13)9-25-17(8-24-11-21-10-22-24)23-16-6-5-14(19)7-15(16)20/h1-7,10-11H,8-9H2
38 atoms
Cl -2.415785 1.152443 3.301681
Cl 5.073852 -1.161327 -3.746887
Cl -4.89093 3.988708 -0.52639
S  1.15192 -1.36825 1.934102
N  -1.192869 -2.287465 0.088557
N  -0.279623 0.739294 1.215786
N  -1.011024 -1.748299 -1.117803
N  -0.716556 -3.966204 -1.191279
C  -1.461715 -1.442039 1.222742
C  2.48299 -0.177172 1.589393
C  -0.28767 -0.504549 1.422426
C  3.12421 -0.415862 0.255106
C  4.464978 -0.772833 0.174059
C  2.395302 -0.296114 -0.92683
C  -1.405055 1.448477 0.810742
C  5.075383 -1.002049 -1.051928
C  2.986984 -0.522132 -2.15717
C  -1.007739 -3.60807 0.035022
C  -2.451198 1.755936 1.681623
C  -1.469343 1.951861 -0.486861
C  4.328115 -0.874127 -2.209509
C  -3.525201 2.536028 1.281884
C  -2.535185 2.724511 -0.908162
C  -3.557188 3.012576 -0.016588
C  -0.728021 -2.792398 -1.853105
H  -1.612422 -2.070283 2.100312
H  -2.384641 -0.890805 1.04824
H  3.205573 -0.287127 2.398024
H  2.053789 0.822817 1.669976
H  5.052385 -0.879431 1.077811
H  1.346282 -0.031589 -0.899729
H  6.119513 -1.280757 -1.094682
H  2.405675 -0.425008 -3.064143
H  -1.101718 -4.251985 0.895408
H  -0.662679 1.733216 -1.173738
H  -4.323017 2.760535 1.976474
H  -2.563071 3.097213 -1.922719
H  -0.523953 -2.705943 -2.909108
elementType: Cl S N C H
totalener: -2653.54190559 hartree
nucrepener: 2677.79371297 hartree
electener: -5331.33561856 hartree
oneelecener: -8971.26318327 hartree
twoeener: 3639.92756471 hartree
cpcmener: -0.02653151 hartree
kineticenergy: 2647.21166016 hartree
xcener: -168.229458537996 hartree
chargesum: 0.0000000
charge: -0.077632 -0.099812 -0.089497 -0.067466 0.122649 -0.287416 -0.355307 -0.406120 -0.106900 -0.023240 0.110743 -0.014873 -0.201768 -0.141914 0.244591 -0.126380 -0.151794 0.075222 -0.088898 -0.237119 0.093800 -0.072115 -0.096736 0.051280 0.084356 0.148225 0.153615 0.136445 0.136023 0.140325 0.111982 0.143355 0.138179 0.176705 0.144041 0.127063 0.145421 0.160968
qa: -0.0776 -0.0998 -0.0895 -0.0675 0.1226 -0.2874 -0.3553 -0.4061 -0.1069 -0.0232 0.1107 -0.0149 -0.2018 -0.1419 0.2446 -0.1264 -0.1518 0.0752 -0.0889 -0.2371 0.0938 -0.0721 -0.0967 0.0513 0.0844 0.1482 0.1536 0.1364 0.1360 0.1403 0.1120 0.1434 0.1382 0.1767 0.1440 0.1271 0.1454 0.1610
va: 1.2459 1.2051 1.2133 2.3743 3.3389 2.9757 2.8343 3.0253 3.9223 3.7166 3.9657 3.7247 4.0002 3.8968 3.7070 3.9577 4.0252 4.0478 3.9983 4.0286 3.8281 3.9931 3.9716 3.8732 4.0128 1.0069 0.9977 1.0083 1.0387 1.0031 1.0191 1.0045 1.0096 0.9922 1.0055 1.0172 1.0036 0.9949
dispcorr: -0.022420099 hartree
energy: -2653.564325686053
dipole: 9.57894 -9.65999 -0.08104 -9.54478 9.55164 0.00686 1.33971 0.20958 1.54929
magnitude: 1.55142 au
magnitude: 3.94340 debye
