program: Gaussian 09
title: 000007483
version: EM64L-G09RevD.01
frameworkgroup: C1[X(C7H8N2O2)]
method: RPBEPBE
basis: SDD
operation: Freq
keyword: #pfreq=noraman
keyword: PBEPBE/SDD
title: #p freq=noraman PBEPBE/SDD
converged: YES YES NO NO
title: Mulliken charges:
elementType: O O N N C C C C C C C H H H H H H H H
charge: -0.235304 -0.234515 -0.402588 0.016626 0.473520 -0.377885 -0.328105 0.384016 -0.347168 -0.369307 -0.633324 0.225195 0.246396 0.283497 0.281888 0.307615 0.239883 0.229568 0.239992
chargesum: 0.00000
title: Mulliken charges with hydrogens summed into heavy atoms:
elementType: O O N N C C C C C C C
charge: -0.235304 -0.234515 -0.094973 0.016626 0.473520 -0.152690 -0.081709 0.384016 -0.063671 -0.087419 0.076119
polarizability: 1.90972226e+02 1.81541875e+00 1.01630420e+02 5.22736209e-02 6.46983252e-03 4.32080292e+01
1716.lowfreq: -6.9672 -5.7947 -0.0006 0.0002 0.0005 6.3118 69.0116 82.4732 145.3121
frequency: 68.9632 82.4483 145.3050 160.4847 167.5695 258.0346 291.7202 336.2198 416.9807 446.0435 476.1213 500.3876 521.2768 611.6647 629.9561 665.3519 732.1026 752.6801 810.1757 814.2535 838.4284 977.2109 983.3384 989.2860 1065.4125 1098.6149 1105.6804 1119.8648 1163.1833 1181.0726 1236.4509 1289.9523 1320.1349 1345.5199 1385.3145 1443.5881 1452.4376 1468.6494 1481.2263 1495.9211 1528.8985 1585.4566 1629.6281 2959.6883 3029.3871 3103.6889 3127.4687 3161.8276 3181.1865 3183.9386 3579.2923
redmass: 5.4601 4.7763 2.4362 1.5352 2.9174 4.5920 4.4497 7.5203 2.4382 1.2998 5.2032 2.8143 5.4703 6.0365 6.7724 4.5741 4.5012 6.5722 5.9124 1.2591 1.8295 1.3215 1.3390 3.0408 2.7115 2.8462 1.4214 1.2828 1.5753 1.4491 4.4837 1.3524 2.0464 6.1332 3.7286 1.5260 2.3994 1.0418 1.8713 1.1557 2.7999 5.4416 6.4521 1.0372 1.1013 1.0969 1.0903 1.0878 1.0947 1.0963 1.0775
irintensity: 0.0210 0.0511 4.9352 0.2099 0.3671 0.9615 1.8200 0.5212 21.7019 100.2664 0.8859 0.6725 2.8021 12.1941 4.9029 24.2736 3.2870 1.2832 5.1409 0.9956 87.5400 3.2536 0.1339 0.2283 10.2588 10.9022 17.7988 1.7593 18.2831 245.5961 491.0782 5.7008 33.5312 91.4689 84.7249 3.1525 1.3520 15.2317 6.9937 11.6962 130.9436 12.5849 394.4348 85.0821 39.9446 20.4139 14.1212 6.0569 0.9833 7.2936 73.5168
temp: 298.150 k
press: 1.00000 atm
elementType: 8 8 7 7 6 6 6 6 6 6 6 1 1 1 1 1 1 1 1
symmnumber: 1
zpe: 379213.1 jmol-1
zpe.correction: 0.144435 hartree
zpe.thermalcorrener: 0.154426 hartree
zpe.thermalcorrenthalpy: 0.155370 hartree
zpe.thermalcorrgfe: 0.108721 hartree
zpe.sumelectzpe: -530.610957 hartree
zpe.sumelectthermal: -530.600965 hartree
zpe.sumelectthermalent: -530.600021 hartree
zpe.sumelectthermalfe: -530.646670 hartree
dipole: 9.3197 0.9158 0.0169
dipole: 9.3646
quadrupole: -66.9567 -58.7962 -66.6215
quadrupole: 0.0422 0.0793 0.0262
quadrupole: -2.8319 5.3286 -2.4967 0.0422 0.0793 0.0262
hfenergy: -530.7553912 hartree
pointgroup: C01 [X(C7H8N2O2)]
dipole: -3.6684928 0.3205016 -0.1173653 debye
dipolederiv: -0.9490533 -0.2107742 -0.032216 -0.5002951 -0.6525419 -0.0335889 -0.0439141 -0.0236178 -0.2561721 -0.8209827 0.2159859 -0.0100062 0.5455084 -0.7481245 -0.0022473 0.0043641 -0.0138211 -0.253085 -1.8074636 -0.0904813 -0.0496975 0.1965786 -0.2356389 0.0106212 -0.012523 0.0013902 -0.4760523 2.393138 -0.0613661 0.0712945 -0.1279226 1.0813802 0.0327712 0.0673776 0.0355312 0.1926358 1.7957099 -0.0543385 0.0525471 -0.3140824 0.0665639 -0.0141246 0.0384581 -0.0054872 0.1650166 -0.6797401 0.0062936 -0.0158886 -0.4741552 0.0715004 -0.0034689 -0.036501 0.0130537 -0.2192195 -0.6155809 0.0166408 -0.0117575 0.6153306 -0.0182263 0.0313462 0.0108585 0.0095791 -0.2331258 -1.2962322 0.0371109 -0.042325 0.0753952 -0.1832685 -0.0051171 -0.0402722 -0.0070355 0.0021213 0.5137051 -0.1049573 0.0156923 -0.3561621 0.1033672 -0.0039732 0.0052208 0.0048749 -0.0841667 0.6339419 0.0741191 0.0272824 0.2655681 0.0556426 0.0145936 0.0361625 0.0085372 -0.0821915 0.5032005 0.1352616 0.017686 0.4427849 0.3524306 0.0259006 0.0212023 0.0139221 0.2762792 0.0051622 0.1013436 -0.0008961 0.0741535 -0.0611487 -0.0073889 -0.0020526 -0.0065378 0.1638675 0.0061752 -0.0881924 -0.0095079 -0.0870472 -0.0170915 -0.0113277 -0.0099142 -0.0105939 0.1652992 0.0877659 -0.073194 -0.0058687 -0.018595 0.0558475 -0.0054887 -0.0036345 -0.0072171 0.1667235 0.1018589 0.0582778 0.0003677 0.0133001 0.0387263 -0.0050741 -0.0012384 -0.0035366 0.1657157 0.1672263 -0.051642 -0.0080715 -0.1479812 0.0956356 -0.013369 -0.0183892 -0.0071921 0.3306511 0.04808 0.0238239 0.0587876 -0.1598502 -0.0182611 -0.1018892 -0.0536921 -0.1112246 -0.0922849 -0.1426423 0.0373847 -0.003225 0.1158912 0.0537163 -0.0038986 0.0009287 -0.0058916 0.1306687 0.0557311 0.0287038 -0.0541976 -0.1584195 -0.0405093 0.0957236 0.0375588 0.1152669 -0.0626807 unknown
polarizability: 190.8299582|-0.9321079|101.4933483|5.0244886|2.4810883|43.4873686 unknown
InChI: InChI=1S/C7H8N2O2/c1-8-6-2-4-7(5-3-6)9(10)11/h2-5,8H,1H3
charge 0 multiplicity 1
19 atoms
O  3.284692 0.954222 0.133064
O  3.077263 -1.319987 0.030858
N  -3.079162 0.426939 -0.100499
N  2.56887 -0.126387 0.064441
C  -1.703177 0.272801 -0.061565
C  -0.860355 1.430505 0.016909
C  -1.09159 -1.021304 -0.096949
C  1.112895 0.009789 0.022039
C  0.530746 1.30289 0.058112
C  0.3038 -1.14848 -0.054954
C  -4.029659 -0.682448 -0.186331
H  -1.31655 2.427477 0.045639
H  -1.710218 -1.92087 -0.157811
H  1.183989 2.17737 0.117812
H  0.786155 -2.129433 -0.081256
H  -3.449054 1.376368 -0.083197
H  -3.897267 -1.266192 -1.118704
H  -5.055699 -0.281225 -0.17828
H  -3.92738 -1.374436 0.672271
