program: Orca
programVersion: 4.2.1
elementType: Cl Cl Cl S N N N N C C C C C C C C C C C C C C C C C H H H H H H H H H H H H H
charge: 0
multiplicity: 1
keywords: wb97x-d3
keywords: def2-TZVPP
keywords: def2/J RIJCOSX GRIDX6 NOFINALGRIDX
keywords: grid4 nofinalgrid
keywords: scfconv7
keywords: smallprint printgap noloewdin
keywords: NOSOSCF
formula: C17H13Cl3N4S
InChI: InChI=1/C17H13Cl3N4S/c18-13-3-1-12(2-4-13)9-25-17(8-24-11-21-10-22-24)23-16-6-5-14(19)7-15(16)20/h1-7,10-11H,8-9H2
38 atoms
Cl -2.278574 -1.477988 -2.559256
Cl 4.352595 2.820336 1.921709
Cl -3.934491 3.335574 -0.851632
S  1.569628 -3.072074 -0.461642
N  -1.630369 -1.735668 1.330925
N  0.161854 -0.907423 -0.876355
N  -2.895893 -1.382145 1.096946
N  -2.087198 -0.280743 2.869894
C  -0.938841 -2.68143 0.496707
C  2.732547 -1.973892 -1.325129
C  0.161839 -2.039251 -0.326614
C  3.132697 -0.778717 -0.510763
C  3.728421 -0.933404 0.737381
C  2.925464 0.507762 -0.994783
C  -0.855102 0.033509 -0.831733
C  4.106187 0.16584 1.491074
C  3.302678 1.62024 -0.257205
C  -1.159852 -1.070375 2.391759
C  -2.013583 -0.064723 -1.601714
C  -0.669143 1.192739 -0.079389
C  3.88757 1.438274 0.984879
C  -2.960556 0.945461 -1.620181
C  -1.612379 2.202148 -0.067134
C  -2.753092 2.071677 -0.843844
C  -3.128398 -0.508611 2.041178
H  -1.669674 -3.139076 -0.170195
H  -0.531101 -3.478575 1.119277
H  2.304547 -1.684498 -2.283969
H  3.592546 -2.614551 -1.531205
H  3.897032 -1.925334 1.139082
H  2.455802 0.652302 -1.958914
H  4.565883 0.030051 2.460758
H  3.131174 2.614776 -0.64682
H  -0.156494 -1.193485 2.770539
H  0.236112 1.293461 0.505023
H  -3.851186 0.84575 -2.225228
H  -1.450183 3.084693 0.536202
H  -4.084312 -0.019155 2.142309
elementType: Cl S N C H
totalener: -2653.53901230 hartree
nucrepener: 2794.94131986 hartree
electener: -5448.48033215 hartree
oneelecener: -9205.68610418 hartree
twoeener: 3757.20577203 hartree
cpcmener: -0.02551724 hartree
kineticenergy: 2647.22027247 hartree
xcener: -168.235736664879 hartree
chargesum: -0.0000000
charge: -0.084888 -0.101919 -0.095717 -0.074758 0.125080 -0.274625 -0.330410 -0.395350 -0.094815 -0.049282 0.140600 0.091834 -0.224408 -0.208640 0.177280 -0.132577 -0.148556 0.056032 -0.000934 -0.236230 0.089806 -0.112392 -0.115509 0.072589 0.074864 0.149713 0.142177 0.118366 0.153330 0.133594 0.131453 0.144151 0.144076 0.168439 0.144553 0.122168 0.142135 0.158771
qa: -0.0849 -0.1019 -0.0957 -0.0748 0.1251 -0.2746 -0.3304 -0.3954 -0.0948 -0.0493 0.1406 0.0918 -0.2244 -0.2086 0.1773 -0.1326 -0.1486 0.0560 -0.0009 -0.2362 0.0898 -0.1124 -0.1155 0.0726 0.0749 0.1497 0.1422 0.1184 0.1533 0.1336 0.1315 0.1442 0.1441 0.1684 0.1446 0.1222 0.1421 0.1588
va: 1.2422 1.2031 1.2064 2.3954 3.3347 3.0047 2.8606 3.0169 3.8756 3.8229 3.9758 3.5306 4.0127 3.9418 3.7577 3.9719 3.9339 4.0688 3.9131 3.9459 3.8254 4.0392 3.9942 3.8346 4.0190 1.0108 1.0069 1.0324 0.9979 1.0138 1.0126 1.0042 1.0044 0.9979 1.0041 1.0197 1.0047 0.9969
dispcorr: -0.025944068 hartree
energy: -2653.564956363274
dipole: 10.38949 -8.86933 1.52016 -11.46437 9.62193 -1.84244 3.92890 -4.31885 -0.38995
magnitude: 2.42024 au
magnitude: 6.15175 debye
