program: Orca
programVersion: 4.2.1
elementType: Cl Cl Cl S N N N N C C C C C C C C C C C C C C C C C H H H H H H H H H H H H H
charge: 0
multiplicity: 1
keywords: wb97x-d3
keywords: def2-TZVPP
keywords: def2/J RIJCOSX GRIDX6 NOFINALGRIDX
keywords: grid4 nofinalgrid
keywords: scfconv7
keywords: smallprint printgap noloewdin
keywords: NOSOSCF
formula: C17H13Cl3N4S
InChI: InChI=1/C17H13Cl3N4S/c18-13-3-1-12(2-4-13)9-25-17(8-24-11-21-10-22-24)23-16-6-5-14(19)7-15(16)20/h1-7,10-11H,8-9H2
38 atoms
Cl -1.374906 -0.663626 3.438124
Cl 4.110992 1.946117 -3.660779
Cl -3.993821 3.412427 1.131849
S  1.680108 -2.826265 0.758509
N  -1.92704 -1.929372 -0.359639
N  0.350844 -0.576223 0.964311
N  -1.585342 -1.654537 -1.620737
N  -3.631907 -0.856508 -1.166409
C  -1.01177 -2.611627 0.507091
C  2.980093 -1.593563 1.060336
C  0.255995 -1.812798 0.75401
C  3.247805 -0.711256 -0.122764
C  3.73735 -1.245152 -1.310022
C  3.027226 0.658566 -0.050871
C  -0.716413 0.310436 1.000434
C  4.005299 -0.436481 -2.400826
C  3.294188 1.483206 -1.132587
C  -3.150843 -1.440361 -0.102621
C  -1.561462 0.423171 2.103644
C  -0.90177 1.202786 -0.054893
C  3.781389 0.928337 -2.303964
C  -2.564878 1.376931 2.155763
C  -1.910555 2.145634 -0.027832
C  -2.738132 2.230574 1.081282
C  -2.635511 -1.009997 -2.065428
H  -0.76727 -3.584436 0.077237
H  -1.503593 -2.787913 1.465491
H  3.858739 -2.188985 1.31589
H  2.705113 -1.013226 1.940399
H  3.903455 -2.312454 -1.394189
H  2.631277 1.090352 0.858553
H  4.384021 -0.862152 -3.319539
H  3.120043 2.548099 -1.064124
H  -3.634033 -1.531069 0.858319
H  -0.242497 1.131054 -0.909412
H  -3.205935 1.443915 3.023337
H  -2.053164 2.81216 -0.866446
H  -2.690416 -0.64236 -3.07791
totalener: -2653.51153176 hartree
nucrepener: 2770.88058627 hartree
electener: -5424.39211803 hartree
oneelecener: -9157.43806070 hartree
twoeener: 3733.04594267 hartree
kineticenergy: 2647.23221526 hartree
xcener: -168.237010199951 hartree
chargesum: 0.0000000
charge: -0.077673 -0.080679 -0.072958 -0.053486 0.115066 -0.284881 -0.300133 -0.315957 -0.146650 -0.091599 0.199381 0.071540 -0.176503 -0.182374 0.222089 -0.109122 -0.124527 0.046136 -0.104032 -0.202558 0.074651 -0.097827 -0.103248 0.095929 0.055439 0.123664 0.136411 0.142802 0.118435 0.109473 0.117315 0.121952 0.124459 0.145527 0.133958 0.115318 0.121335 0.133326
qa: -0.0777 -0.0807 -0.0730 -0.0535 0.1151 -0.2849 -0.3001 -0.3160 -0.1467 -0.0916 0.1994 0.0715 -0.1765 -0.1824 0.2221 -0.1091 -0.1245 0.0461 -0.1040 -0.2026 0.0747 -0.0978 -0.1032 0.0959 0.0554 0.1237 0.1364 0.1428 0.1184 0.1095 0.1173 0.1220 0.1245 0.1455 0.1340 0.1153 0.1213 0.1333
va: 1.2520 1.2266 1.2308 2.4073 3.2875 2.9904 2.8308 3.0428 3.9435 3.8469 3.9186 3.5807 4.0466 3.9769 3.6742 4.0014 3.9726 4.0594 3.9594 3.9407 3.9384 4.0063 4.0139 3.9145 4.0528 1.0151 1.0055 0.9978 1.0353 1.0185 1.0168 1.0113 1.0107 0.9991 1.0165 1.0220 1.0118 1.0022
dispcorr: -0.025257569 hartree
energy: -2653.536789333251
dipole: 7.57854 -6.96740 0.61114 -11.74821 10.71251 -1.03570 -2.55591 3.35512 0.79921
magnitude: 1.44392 au
magnitude: 3.67015 debye
