program: Orca
programVersion: 4.2.1
elementType: Cl Cl Cl S N N N N C C C C C C C C C C C C C C C C C H H H H H H H H H H H H H
charge: 0
multiplicity: 1
keywords: wb97x-d3
keywords: def2-TZVPP
keywords: def2/J RIJCOSX GRIDX6 NOFINALGRIDX
keywords: grid4 nofinalgrid
keywords: scfconv7
keywords: smallprint printgap noloewdin
keywords: NOSOSCF
formula: C17H13Cl3N4S
InChI: InChI=1/C17H13Cl3N4S/c18-13-3-1-12(2-4-13)9-25-17(8-24-11-21-10-22-24)23-16-6-5-14(19)7-15(16)20/h1-7,10-11H,8-9H2
38 atoms
Cl -1.990695 0.740489 3.045046
Cl 4.803283 0.800546 -3.725771
Cl -4.746251 2.833898 -1.054392
S  1.694966 -1.724106 1.946446
N  -1.774511 -2.103301 0.225087
N  0.079723 0.088987 0.947029
N  -1.293963 -2.335899 -0.998717
N  -3.477845 -1.832681 -1.091597
C  -0.910116 -2.161292 1.36651
C  2.758139 -0.255083 1.82351
C  0.182159 -1.106321 1.327333
C  3.249009 0.004601 0.430839
C  2.826574 1.120174 -0.281594
C  4.157738 -0.862532 -0.167866
C  -1.091385 0.680627 0.492412
C  3.301608 1.37219 -1.559749
C  4.639298 -0.626662 -1.443267
C  -3.080279 -1.79913 0.151276
C  -2.109433 1.088919 1.353486
C  -1.227622 0.98088 -0.862272
C  4.205861 0.495052 -2.133837
C  -3.230752 1.756699 0.888868
C  -2.348263 1.627878 -1.344983
C  -3.346825 2.015601 -0.464799
C  -2.348671 -2.161609 -1.755785
H  -0.467694 -3.156846 1.43058
H  -1.50833 -2.008183 2.266522
H  3.588344 -0.466145 2.499755
H  2.20842 0.595324 2.224972
H  2.112533 1.800689 0.162009
H  4.49442 -1.743463 0.365702
H  2.969196 2.245507 -2.103673
H  5.346355 -1.306609 -1.897666
H  -3.682488 -1.562417 1.015307
H  -0.43741 0.679763 -1.536724
H  -4.005546 2.061471 1.578031
H  -2.445685 1.829917 -2.402112
H  -2.305962 -2.282097 -2.826721
totalener: -2653.51167330 hartree
nucrepener: 2750.86629250 hartree
electener: -5404.37796580 hartree
oneelecener: -9117.35397280 hartree
twoeener: 3712.97600700 hartree
kineticenergy: 2647.22828740 hartree
xcener: -168.235953517787 hartree
chargesum: -0.0000000
charge: -0.076993 -0.080387 -0.072485 -0.051714 0.117076 -0.292161 -0.301180 -0.315659 -0.147877 -0.092090 0.202521 0.049444 -0.162126 -0.177349 0.228358 -0.127769 -0.112592 0.045273 -0.112543 -0.207684 0.078566 -0.091013 -0.093814 0.090275 0.056108 0.124803 0.136930 0.143604 0.118972 0.122311 0.111006 0.123623 0.121984 0.145116 0.130654 0.115196 0.120978 0.132638
qa: -0.0770 -0.0804 -0.0725 -0.0517 0.1171 -0.2922 -0.3012 -0.3157 -0.1479 -0.0921 0.2025 0.0494 -0.1621 -0.1773 0.2284 -0.1278 -0.1126 0.0453 -0.1125 -0.2077 0.0786 -0.0910 -0.0938 0.0903 0.0561 0.1248 0.1369 0.1436 0.1190 0.1223 0.1110 0.1236 0.1220 0.1451 0.1307 0.1152 0.1210 0.1326
va: 1.2528 1.2266 1.2314 2.4100 3.2868 2.9735 2.8283 3.0426 3.9440 3.8366 3.9175 3.6005 3.9773 4.0436 3.6735 3.9891 4.0050 4.0607 3.9672 3.9455 3.9380 3.9977 3.9999 3.9205 4.0517 1.0152 1.0046 0.9981 1.0378 1.0139 1.0158 1.0114 1.0113 0.9996 1.0200 1.0217 1.0117 1.0022
dispcorr: -0.024854857 hartree
energy: -2653.536528157078
dipole: 8.63455 -8.08687 0.54768 -9.67718 9.25618 -0.42100 3.73644 -2.50883 1.22761
magnitude: 1.40862 au
magnitude: 3.58043 debye
