program: Orca
programVersion: 4.2.1
elementType: Cl Cl Cl S N N N N C C C C C C C C C C C C C C C C C H H H H H H H H H H H H H
charge: 0
multiplicity: 1
keywords: wb97x-d3
keywords: def2-TZVPP
keywords: def2/J RIJCOSX GRIDX6 NOFINALGRIDX
keywords: grid4 nofinalgrid
keywords: scfconv7
keywords: smallprint printgap noloewdin
keywords: NOSOSCF
formula: C17H13Cl3N4S
InChI: InChI=1/C17H13Cl3N4S/c18-13-3-1-12(2-4-13)9-25-17(8-24-11-21-10-22-24)23-16-6-5-14(19)7-15(16)20/h1-7,10-11H,8-9H2
38 atoms
Cl -0.041333 1.125908 0.948901
Cl 4.305587 2.082403 1.791461
Cl -3.183825 4.581012 -1.693754
S  0.287407 -3.022898 -0.666614
N  -1.923438 -2.527444 1.188299
N  -0.392555 -0.615078 -1.460198
N  -2.229537 -3.828935 1.172675
N  -1.352333 -3.249477 3.153428
C  -2.041949 -1.727316 0.005416
C  1.806308 -2.351546 -1.402759
C  -0.740158 -1.610712 -0.767197
C  2.420843 -1.24522 -0.595485
C  2.692605 -0.016211 -1.182459
C  2.740842 -1.427269 0.745641
C  -1.097844 0.580279 -1.479983
C  3.27884 1.009828 -0.459598
C  3.321109 -0.409966 1.484292
C  -1.388048 -2.200615 2.375588
C  -0.990653 1.509117 -0.440941
C  -1.861941 0.933656 -2.589994
C  3.587873 0.80599 0.874026
C  -1.626947 2.738143 -0.50143
C  -2.508655 2.153807 -2.662533
C  -2.388103 3.052178 -1.614076
C  -1.874793 -4.218866 2.371656
H  -2.406664 -0.734399 0.267444
H  -2.793704 -2.192985 -0.633267
H  1.597664 -2.029936 -2.422286
H  2.471375 -3.216295 -1.45873
H  2.429651 0.151285 -2.218852
H  2.522003 -2.370474 1.231528
H  3.479185 1.963767 -0.926868
H  3.565708 -0.561265 2.526601
H  -1.051072 -1.203585 2.615126
H  -1.937364 0.233268 -3.411133
H  -1.527227 3.439579 0.314759
H  -3.099937 2.405468 -3.531554
H  -2.002117 -5.238735 2.698069
totalener: -2653.51094024 hartree
nucrepener: 2789.04375651 hartree
electener: -5442.55469676 hartree
oneelecener: -9193.48943082 hartree
twoeener: 3750.93473406 hartree
kineticenergy: 2647.23686869 hartree
xcener: -168.236885854195 hartree
chargesum: -0.0000000
charge: -0.074578 -0.080982 -0.069492 -0.028408 0.077718 -0.276753 -0.301209 -0.326333 -0.117985 -0.071760 0.147737 0.105985 -0.194174 -0.226168 0.170022 -0.102054 -0.105287 0.058683 -0.058050 -0.219290 0.062969 -0.078647 -0.073633 0.049884 0.071826 0.148456 0.139536 0.110392 0.140273 0.108041 0.118982 0.120695 0.125937 0.139081 0.125134 0.123378 0.125231 0.134841
qa: -0.0746 -0.0810 -0.0695 -0.0284 0.0777 -0.2768 -0.3012 -0.3263 -0.1180 -0.0718 0.1477 0.1060 -0.1942 -0.2262 0.1700 -0.1021 -0.1053 0.0587 -0.0581 -0.2193 0.0630 -0.0786 -0.0736 0.0499 0.0718 0.1485 0.1395 0.1104 0.1403 0.1080 0.1190 0.1207 0.1259 0.1391 0.1251 0.1234 0.1252 0.1348
va: 1.2549 1.2238 1.2341 2.4309 3.3124 2.9501 2.8447 3.0602 3.8963 3.8408 3.9452 3.5187 3.9791 4.0394 3.7105 3.9648 3.9636 4.0600 3.9717 4.0515 3.9124 3.9897 3.9770 3.9513 4.0405 0.9903 1.0121 1.0362 0.9987 1.0186 1.0198 1.0111 1.0103 1.0191 1.0173 1.0186 1.0103 0.9999
dispcorr: -0.024686660 hartree
energy: -2653.535626900531
dipole: -0.44257 0.18260 -0.25997 -19.15056 19.06757 -0.08298 -5.95459 4.67816 -1.27643
magnitude: 1.30528 au
magnitude: 3.31775 debye
