program: Orca
programVersion: 4.2.1
elementType: Cl Cl Cl S N N N N C C C C C C C C C C C C C C C C C H H H H H H H H H H H H H
charge: 0
multiplicity: 1
keywords: wb97x-d3
keywords: def2-TZVPP
keywords: def2/J RIJCOSX GRIDX6 NOFINALGRIDX
keywords: grid4 nofinalgrid
keywords: scfconv7
keywords: smallprint printgap noloewdin
keywords: NOSOSCF
formula: C17H13Cl3N4S
InChI: InChI=1/C17H13Cl3N4S/c18-13-3-1-12(2-4-13)9-25-17(8-24-11-21-10-22-24)23-16-6-5-14(19)7-15(16)20/h1-7,10-11H,8-9H2
38 atoms
Cl -0.945141 1.621001 1.420837
Cl 3.388936 1.440824 2.752831
Cl -0.959046 4.490179 -3.108493
S  -0.432674 -2.444134 -1.671892
N  -1.149826 -3.189505 1.409314
N  -1.913395 -0.569768 -0.252245
N  -0.552877 -4.384449 1.419234
N  0.267972 -3.079747 3.048947
C  -2.12002 -2.833924 0.404622
C  0.833384 -1.182792 -2.007863
C  -1.555562 -1.752527 -0.494415
C  1.45089 -0.549252 -0.794448
C  1.743134 -1.276736 0.353241
C  1.782331 0.800269 -0.830773
C  -1.616099 0.572876 -0.967003
C  2.336704 -0.672581 1.449144
C  2.389146 1.415839 0.250968
C  -0.643995 -2.417362 2.384063
C  -1.220342 1.718649 -0.271846
C  -1.822581 0.680294 -2.341512
C  2.658157 0.673716 1.389338
C  -1.010578 2.920179 -0.923432
C  -1.627425 1.878406 -3.006655
C  -1.216447 2.992445 -2.292138
C  0.284406 -4.276199 2.421762
H  -3.027174 -2.454795 0.873531
H  -2.360889 -3.742281 -0.146396
H  0.451682 -0.424544 -2.689742
H  1.580897 -1.759548 -2.560183
H  1.506388 -2.332342 0.40146
H  1.558278 1.387921 -1.713157
H  2.52669 -1.247611 2.344796
H  2.6373 2.467414 0.213476
H  -0.95376 -1.396471 2.549069
H  -2.158326 -0.188985 -2.893029
H  -0.690058 3.789387 -0.36684
H  -1.79968 1.944833 -4.071766
H  0.929593 -5.089831 2.713843
totalener: -2653.50655511 hartree
nucrepener: 2867.43809316 hartree
electener: -5520.94464827 hartree
oneelecener: -9350.15067074 hartree
twoeener: 3829.20602247 hartree
kineticenergy: 2647.23003156 hartree
xcener: -168.237159876832 hartree
chargesum: -0.0000000
charge: -0.058778 -0.074487 -0.067249 -0.052834 0.094707 -0.250389 -0.291483 -0.339878 -0.058588 -0.092820 0.064850 0.011715 -0.193257 -0.160120 0.174320 -0.107081 -0.159909 0.038159 0.051987 -0.256498 0.097952 -0.127547 -0.097788 0.052058 0.062805 0.129795 0.132144 0.119723 0.147231 0.150061 0.128425 0.131691 0.119246 0.152208 0.149863 0.118416 0.129059 0.132291
qa: -0.0588 -0.0745 -0.0672 -0.0528 0.0947 -0.2504 -0.2915 -0.3399 -0.0586 -0.0928 0.0649 0.0117 -0.1933 -0.1601 0.1743 -0.1071 -0.1599 0.0382 0.0520 -0.2565 0.0980 -0.1275 -0.0978 0.0521 0.0628 0.1298 0.1321 0.1197 0.1472 0.1501 0.1284 0.1317 0.1192 0.1522 0.1499 0.1184 0.1291 0.1323
va: 1.2634 1.2326 1.2367 2.3837 3.3349 3.0146 2.8521 3.0147 3.8445 3.9106 4.0467 3.6391 3.9706 3.9192 3.7343 3.9702 4.0402 4.0469 3.9939 4.0122 3.9085 3.9923 3.9895 3.9117 4.0247 1.0143 1.0135 1.0084 0.9921 1.0014 0.9933 1.0292 1.0167 1.0153 1.0073 1.0236 1.0102 1.0024
dispcorr: -0.028985320 hartree
energy: -2653.535540431343
dipole: -1.80669 1.21609 -0.59059 -18.76041 18.65199 -0.10842 -6.24955 4.76210 -1.48746
magnitude: 1.60408 au
magnitude: 4.07725 debye
