program: Gaussian 09
title: 000073648
version: EM64L-G09RevD.01
frameworkgroup: C1[X(C20H20O8)]
method: RPBEPBE
basis: SDD
operation: Freq
keyword: #pfreq=noraman
keyword: PBEPBE/SDD
title: #p freq=noraman PBEPBE/SDD
converged: YES YES NO NO
title: Mulliken charges:
elementType: O O O O O O O O C C C C C C C C C C C C C C C C C C C C H H H H H H H H H H H H H H H H H H H H
charge: -0.284398 -0.303131 -0.279244 -0.435553 -0.284275 -0.288428 -0.290573 -0.350714 0.002091 0.263956 0.215148 0.446672 0.137788 0.255857 -0.420760 -0.593437 0.028695 0.270932 -0.533217 -0.565296 0.287808 0.263561 0.036796 -0.517699 -0.519908 -0.535292 -0.523175 -0.513922 0.247104 0.287253 0.294404 0.243268 0.383083 0.225825 0.280891 0.215274 0.217324 0.273296 0.229812 0.225585 0.231593 0.247924 0.264222 0.215389 0.231017 0.222469 0.262382 0.231605
chargesum: 0.00000
title: Mulliken charges with hydrogens summed into heavy atoms:
elementType: O O O O O O O O C C C C C C C C C C C C C C C C C C C C
charge: -0.284398 -0.303131 -0.279244 -0.052470 -0.284275 -0.288428 -0.290573 -0.350714 0.002091 0.263956 0.215148 0.446672 0.137788 0.255857 -0.173657 -0.306184 0.028695 0.270932 -0.238813 -0.322029 0.287808 0.263561 0.036796 0.204291 0.200524 0.169810 0.187453 0.202534
polarizability: 4.87801695e+02 -1.19298903e+00 2.97228577e+02 -1.88721555e+00 1.72470545e+00 1.27037263e+02
1716.lowfreq: -5.3751 -0.7362 -0.0008 -0.0003 0.0007 7.0166 10.1269 27.7219 51.9829
frequency: 9.8673 27.6743 51.9778 52.8247 59.1396 69.7294 78.7383 82.1059 85.9353 97.6864 107.6115 132.6960 139.3030 148.2665 151.9579 161.0400 173.6480 187.2244 195.0670 200.3318 208.5049 219.0796 233.3453 251.4391 265.6541 278.2082 280.7575 299.3525 310.4999 313.2732 346.8003 355.7311 389.5903 398.3414 413.6170 438.2449 467.1630 497.1993 499.1066 511.8936 554.0312 562.7929 584.4088 594.4562 599.5921 607.4829 619.4806 643.9878 674.7703 689.5593 701.5278 714.3958 743.1897 766.7396 785.2561 837.1564 841.4235 849.4330 851.3466 869.2936 899.3137 908.5900 917.5856 949.4858 961.2813 981.8850 988.8429 1032.3288 1064.3048 1073.0969 1082.0244 1108.7259 1110.1111 1110.9136 1112.3199 1115.0987 1144.3232 1149.4066 1154.0758 1158.3354 1159.8315 1162.3720 1169.1634 1193.0273 1215.0135 1242.5646 1258.9998 1304.1875 1321.5881 1324.6030 1375.9919 1387.2548 1403.2784 1405.5919 1411.3074 1418.7938 1424.9855 1435.9938 1438.0651 1444.2121 1452.2790 1455.2317 1456.2436 1458.0516 1464.2223 1468.2614 1468.9179 1478.7288 1480.6256 1483.4898 1483.9487 1486.2311 1547.4974 1567.4181 1573.1700 1589.1463 1601.3292 1658.8273 2540.7634 2966.4925 2977.4642 2983.2687 2984.9609 2987.1789 3058.0038 3086.4892 3094.7885 3096.6462 3096.9180 3129.2132 3130.8554 3133.3573 3133.6077 3139.3566 3177.1499 3193.8282 3195.3276 3197.5818
redmass: 5.1855 4.7104 4.0111 2.9394 2.5778 3.5020 2.5316 2.2940 2.3180 2.6212 3.3586 2.5123 1.8134 4.3812 1.9749 1.4777 1.6227 2.4308 3.3075 3.1243 3.0202 3.7452 3.4424 6.5190 5.6760 2.6026 3.4214 5.0152 4.1824 5.2243 7.8816 5.2675 5.0727 7.6232 6.1705 7.0674 7.0033 8.3205 7.1934 7.0520 7.7909 5.8594 8.2840 4.5533 4.2114 5.9923 5.4818 5.5911 5.3571 3.7926 4.5931 4.8930 4.9512 3.7210 7.0959 1.9716 1.8793 1.5615 4.1873 7.1004 6.0336 1.6554 8.2533 9.1035 8.4880 5.4137 1.0681 4.9601 4.0496 4.4017 6.2900 1.2325 1.2434 1.2379 1.2579 1.2337 1.8332 1.5083 1.4392 1.4481 1.4602 1.5138 2.6608 3.3341 1.6941 2.2278 1.7356 5.3501 4.4024 6.7580 4.8370 5.3997 3.0381 2.9449 2.4562 1.3180 1.6447 1.3222 1.3172 1.3633 1.2620 1.1596 1.1026 1.0808 2.2363 1.0554 1.5009 1.3410 1.1998 1.0558 1.0561 1.0534 6.9028 4.6258 5.0417 7.6436 5.9198 3.7293 1.0772 1.0326 1.0343 1.0330 1.0345 1.0320 1.1044 1.0979 1.0990 1.1008 1.0972 1.1001 1.1047 1.1049 1.1056 1.1056 1.0901 1.0930 1.0918 1.0911
irintensity: 0.8586 0.9099 0.5489 0.9856 8.3136 1.4391 10.1817 7.8365 7.4200 1.2934 3.2277 4.8009 1.5243 5.0674 0.8634 3.3130 1.5593 1.1415 5.7843 12.3993 1.6167 8.3174 2.3901 2.7184 8.1375 1.7154 4.2791 1.7036 7.5539 4.6817 15.4460 10.4184 1.7276 8.0403 19.3078 2.8712 3.9321 0.7443 1.1421 5.5488 56.1470 0.7647 1.8207 7.3303 7.6647 16.9888 4.6826 1.0598 9.1413 5.2078 29.0441 2.3368 5.3856 18.0607 8.1859 1.8582 27.0177 51.8711 6.7204 13.2671 37.3409 31.1509 9.3166 60.2082 55.5291 107.6028 134.3039 77.7209 159.5436 52.3663 194.9328 37.3063 20.4090 3.2419 0.2177 10.8756 6.7950 38.5415 48.1610 29.0231 40.3480 73.0710 86.2228 21.3363 7.0432 85.9732 96.4676 114.9268 473.7243 560.4011 67.9559 30.8733 180.6054 219.3525 156.0095 17.4963 204.4959 23.3124 121.8100 49.5795 36.8370 40.9098 19.2595 17.9799 108.9298 15.8971 96.1075 124.8719 14.4000 14.2197 33.4098 29.7311 18.0548 218.7129 66.1786 459.8064 15.5663 207.6036 538.9643 47.8756 88.4042 93.4534 109.2711 88.1049 39.0323 35.1317 35.7769 33.0038 34.4481 23.0311 13.4586 16.7643 11.6312 9.1170 2.8127 0.4840 0.3375 6.3960
temp: 298.150 k
press: 1.00000 atm
elementType: 8 8 8 8 8 8 8 8 6 6 6 6 6 6 6 6 6 6 6 6 6 6 6 6 6 6 6 6 1 1 1 1 1 1 1 1 1 1 1 1 1 1 1 1 1 1 1 1
symmnumber: 1
zpe: 952686.2 jmol-1
zpe.correction: 0.362859 hartree
zpe.thermalcorrener: 0.390895 hartree
zpe.thermalcorrenthalpy: 0.391839 hartree
zpe.thermalcorrgfe: 0.302831 hartree
zpe.sumelectzpe: -1373.787611 hartree
zpe.sumelectthermal: -1373.759574 hartree
zpe.sumelectthermalent: -1373.758630 hartree
zpe.sumelectthermalfe: -1373.847638 hartree
dipole: -4.2266 0.0159 -0.3276
dipole: 4.2393
quadrupole: -128.8440 -158.6990 -162.5193
quadrupole: 19.8085 1.0260 -6.7817
quadrupole: 21.1768 -8.6783 -12.4985 19.8085 1.0260 -6.7817
hfenergy: -1374.1504695 hartree
pointgroup: C01 [X(C20H20O8)]
dipole: 1.6636131 0.0199662 -0.1171802 debye
polarizability: 487.7571714|1.2737031|297.1728488|4.3671152|3.5783943|127.1375152 unknown
InChI: InChI=1S/C20H20O8/c1-23-14-6-10(7-15(24-2)19(14)26-4)12-8-11(21)17-13(28-12)9-16(25-3)20(27-5)18(17)22/h6-9,22H,1-5H3
charge 0 multiplicity 1
48 atoms
O  -0.449977 -0.660896 -0.056935
O  -6.086108 -0.300837 -0.052187
O  -4.707749 -2.817832 -0.112136
O  -4.476495 2.099735 -0.06046
O  5.175265 1.785382 -0.32135
O  3.907686 -2.876058 0.363844
O  5.923217 -0.891675 0.061441
O  -2.168087 3.147125 -0.004694
C  -2.456201 0.756179 -0.041602
C  -1.855016 -0.529305 -0.062775
C  0.362685 0.47933 -0.029793
C  1.798041 0.144081 -0.025406
C  -3.886952 0.852777 -0.059872
C  -1.626924 1.95666 -0.017043
C  -0.194748 1.748038 -0.00606
C  -2.613914 -1.701977 -0.117259
C  -4.682731 -0.324755 -0.061372
C  -4.027683 -1.598213 -0.123502
C  2.216276 -1.2011 0.110293
C  2.776774 1.166271 -0.170056
C  4.147062 0.843934 -0.151745
C  3.587639 -1.528936 0.137795
C  4.577626 -0.509034 0.03802
C  -6.739903 0.559975 0.963423
C  -5.859673 -3.009403 -1.024148
C  4.789401 3.177968 -0.574663
C  4.81307 -3.53533 -0.604104
C  6.816992 -0.213911 1.030681
H  0.441475 2.633044 0.037164
H  -2.146873 -2.687467 -0.154797
H  1.487004 -2.006282 0.215338
H  2.46589 2.201858 -0.322933
H  -3.688498 2.796619 -0.043808
H  -7.817444 0.37989 0.830043
H  -6.489862 1.617909 0.789213
H  -6.426271 0.253597 1.979223
H  -5.51898 -2.938942 -2.074547
H  -6.645558 -2.264302 -0.83028
H  -6.213592 -4.029308 -0.811737
H  4.229641 3.603431 0.280384
H  4.186006 3.261738 -1.498507
H  5.739014 3.717583 -0.702095
H  5.786964 -3.021917 -0.645925
H  4.345593 -3.553323 -1.607525
H  4.92852 -4.562848 -0.227589
H  6.432059 -0.349942 2.058373
H  6.907959 0.857103 0.791262
H  7.78598 -0.723435 0.920808
