program: Orca
programVersion: 4.2.1
elementType: Cl Cl Cl S N N N N C C C C C C C C C C C C C C C C C H H H H H H H H H H H H H
charge: 0
multiplicity: 1
keywords: wb97x-d3
keywords: def2-TZVPP
keywords: def2/J RIJCOSX GRIDX6 NOFINALGRIDX
keywords: grid4 nofinalgrid
keywords: scfconv7
keywords: smallprint printgap noloewdin
keywords: NOSOSCF
formula: C17H13Cl3N4S
InChI: InChI=1/C17H13Cl3N4S/c18-13-3-1-12(2-4-13)9-25-17(8-24-11-21-10-22-24)23-16-6-5-14(19)7-15(16)20/h1-7,10-11H,8-9H2
38 atoms
Cl 0.163248 2.023201 -1.685583
Cl 6.147429 -0.529166 -1.081894
Cl -4.03876 4.951323 -0.082022
S  -0.382701 -0.055199 1.48631
N  -0.768495 -3.231958 0.420683
N  -1.509868 -0.321032 -0.89562
N  -0.095727 -3.876467 1.379333
N  -2.208045 -4.615211 1.276613
C  -0.16128 -2.200919 -0.384501
C  1.088929 -0.89979 2.140952
C  -0.721998 -0.839146 -0.053556
C  2.330322 -0.786724 1.302349
C  2.69479 0.399684 0.673436
C  3.161869 -1.89461 1.171731
C  -2.0817 0.929328 -0.662239
C  3.866926 0.483639 -0.058504
C  4.339411 -1.823504 0.443046
C  -2.029328 -3.685061 0.374858
C  -1.423563 2.106543 -1.016824
C  -3.359123 1.028949 -0.120143
C  4.6866 -0.629702 -0.166976
C  -2.020806 3.343653 -0.845119
C  -3.967297 2.2574 0.065068
C  -3.291923 3.410769 -0.300045
C  -0.998404 -4.693939 1.865957
H  -0.371468 -2.384667 -1.437465
H  0.915335 -2.252214 -0.239912
H  0.858927 -1.941461 2.360217
H  1.233749 -0.399916 3.102298
H  2.0499 1.266703 0.737484
H  2.880214 -2.833147 1.634711
H  4.140935 1.409673 -0.544902
H  4.976656 -2.691547 0.347035
H  -2.762586 -3.313594 -0.324819
H  -3.881913 0.121796 0.152863
H  -1.494423 4.24373 -1.129832
H  -4.959258 2.315333 0.490148
H  -0.773605 -5.375394 2.671184
totalener: -2653.51244885 hartree
nucrepener: 2691.35764139 hartree
electener: -5344.87009024 hartree
oneelecener: -8997.78890822 hartree
twoeener: 3652.91881798 hartree
kineticenergy: 2647.22353262 hartree
xcener: -168.230971131673 hartree
chargesum: -0.0000000
charge: -0.070235 -0.074668 -0.073103 -0.032782 0.113182 -0.242693 -0.346866 -0.330053 -0.105305 -0.076464 0.070948 -0.013064 -0.179707 -0.195027 0.154395 -0.101082 -0.106484 0.050906 -0.005800 -0.171378 0.069899 -0.105614 -0.099451 0.062541 0.087809 0.136106 0.162918 0.132763 0.138545 0.119536 0.131352 0.125828 0.126439 0.153002 0.118488 0.115748 0.124502 0.134872
qa: -0.0702 -0.0747 -0.0731 -0.0328 0.1132 -0.2427 -0.3469 -0.3301 -0.1053 -0.0765 0.0709 -0.0131 -0.1797 -0.1950 0.1544 -0.1011 -0.1065 0.0509 -0.0058 -0.1714 0.0699 -0.1056 -0.0995 0.0625 0.0878 0.1361 0.1629 0.1328 0.1385 0.1195 0.1314 0.1258 0.1264 0.1530 0.1185 0.1157 0.1245 0.1349
va: 1.2522 1.2317 1.2302 2.4042 3.2903 2.9910 2.8304 3.0651 3.8167 3.8479 3.9806 3.6664 4.0030 3.9625 3.8562 3.9973 4.0007 4.0687 4.0139 4.0331 3.9483 4.0365 4.0016 3.9305 4.0239 1.0236 0.9986 1.0423 0.9932 1.0341 1.0247 1.0113 1.0104 1.0028 1.0141 1.0214 1.0104 0.9995
dispcorr: -0.022696492 hartree
energy: -2653.535145346872
dipole: -1.06558 1.29886 0.23328 -19.90083 19.69394 -0.20689 10.37068 -9.97653 0.39415
magnitude: 0.50257 au
magnitude: 1.27743 debye
