program: Orca
programVersion: 4.2.1
elementType: Cl Cl Cl S N N N N C C C C C C C C C C C C C C C C C H H H H H H H H H H H H H
charge: 0
multiplicity: 1
keywords: wb97x-d3
keywords: def2-TZVPP
keywords: def2/J RIJCOSX GRIDX6 NOFINALGRIDX
keywords: grid4 nofinalgrid
keywords: scfconv7
keywords: smallprint printgap noloewdin
keywords: NOSOSCF
formula: C17H13Cl3N4S
InChI: InChI=1/C17H13Cl3N4S/c18-13-3-1-12(2-4-13)9-25-17(8-24-11-21-10-22-24)23-16-6-5-14(19)7-15(16)20/h1-7,10-11H,8-9H2
38 atoms
Cl -3.815908 -0.238198 -0.058046
Cl 6.561757 0.366294 0.857712
Cl -3.761835 4.361651 -2.81899
S  -0.1221 -0.60195 -1.043348
N  -0.423166 -2.442791 1.736664
N  -1.185624 0.68543 1.013435
N  0.325293 -3.542318 1.589758
N  -1.831974 -4.09157 1.842801
C  0.156817 -1.122238 1.748603
C  1.282765 -1.759786 -1.069512
C  -0.420896 -0.256399 0.657326
C  2.585879 -1.199683 -0.576698
C  3.3619 -1.94026 0.308469
C  3.060788 0.034992 -1.008995
C  -1.776878 1.526541 0.072303
C  4.587672 -1.466824 0.753073
C  4.282274 0.518433 -0.574716
C  -1.709721 -2.789803 1.886912
C  -3.02163 1.233084 -0.480604
C  -1.160872 2.720285 -0.292501
C  5.041622 -0.237967 0.306451
C  -3.638956 2.100577 -1.366316
C  -1.760179 3.594598 -1.179903
C  -2.999503 3.277785 -1.713595
C  -0.56263 -4.505217 1.658994
H  1.234962 -1.233926 1.657363
H  -0.055879 -0.626262 2.695636
H  1.353775 -2.01068 -2.130882
H  1.028736 -2.681844 -0.549171
H  2.997638 -2.894816 0.669841
H  2.465708 0.634509 -1.686621
H  5.180098 -2.049714 1.444457
H  4.644282 1.477814 -0.917368
H  -2.502299 -2.068605 2.016266
H  -0.198483 2.961296 0.138605
H  -4.605146 1.852972 -1.782355
H  -1.267027 4.516537 -1.453741
H  -0.282083 -5.54347 1.575834
totalener: -2653.51273213 hartree
nucrepener: 2672.38381214 hartree
electener: -5325.89654427 hartree
oneelecener: -8959.71873574 hartree
twoeener: 3633.82219147 hartree
kineticenergy: 2647.22348805 hartree
xcener: -168.230913379012 hartree
chargesum: 0.0000000
charge: -0.067790 -0.073461 -0.073084 -0.030524 0.108342 -0.239847 -0.355254 -0.328977 -0.102538 -0.081282 0.062746 -0.007970 -0.193907 -0.183527 0.156618 -0.109224 -0.107509 0.064334 -0.008425 -0.176693 0.068618 -0.105717 -0.097536 0.061094 0.086646 0.165583 0.134642 0.142793 0.133256 0.141023 0.118690 0.127523 0.124437 0.149354 0.121206 0.117967 0.123672 0.134719
qa: -0.0678 -0.0735 -0.0731 -0.0305 0.1083 -0.2398 -0.3553 -0.3290 -0.1025 -0.0813 0.0627 -0.0080 -0.1939 -0.1835 0.1566 -0.1092 -0.1075 0.0643 -0.0084 -0.1767 0.0686 -0.1057 -0.0975 0.0611 0.0866 0.1656 0.1346 0.1428 0.1333 0.1410 0.1187 0.1275 0.1244 0.1494 0.1212 0.1180 0.1237 0.1347
va: 1.2549 1.2331 1.2304 2.3969 3.2753 3.0051 2.8058 3.0690 3.8036 3.8488 3.9859 3.6416 3.9400 4.0239 3.8464 4.0116 3.9988 4.0557 4.0092 4.0338 3.9490 4.0258 3.9956 3.9306 4.0198 0.9914 1.0233 0.9938 1.0388 1.0301 1.0225 1.0105 1.0111 1.0177 1.0140 1.0193 1.0101 0.9990
dispcorr: -0.022371494 hartree
energy: -2653.535103624186
dipole: 10.44327 -9.52181 0.92146 -13.19997 13.38212 0.18215 4.88812 -5.10338 -0.21526
magnitude: 0.96364 au
magnitude: 2.44939 debye
