program: Orca
programVersion: 4.2.1
elementType: Cl Cl Cl S N N N N C C C C C C C C C C C C C C C C C H H H H H H H H H H H H H
charge: 0
multiplicity: 1
keywords: wb97x-d3
keywords: def2-TZVPP
keywords: def2/J RIJCOSX GRIDX6 NOFINALGRIDX
keywords: grid4 nofinalgrid
keywords: scfconv7
keywords: smallprint printgap noloewdin
keywords: NOSOSCF
formula: C17H13Cl3N4S
InChI: InChI=1/C17H13Cl3N4S/c18-13-3-1-12(2-4-13)9-25-17(8-24-11-21-10-22-24)23-16-6-5-14(19)7-15(16)20/h1-7,10-11H,8-9H2
38 atoms
Cl -2.33607 0.527574 2.580455
Cl 4.960999 1.353771 -2.954127
Cl -2.974804 4.930481 -0.424735
S  0.653846 -2.572106 0.796332
N  -2.172644 -2.809203 0.039041
N  -0.0076 -0.03018 0.768282
N  -1.962697 -3.912788 -0.686521
N  -3.171916 -4.389675 1.140661
C  -1.614093 -1.54372 -0.343447
C  2.145347 -1.714146 1.379723
C  -0.362627 -1.193522 0.435996
C  2.847951 -0.949326 0.296581
C  3.310144 -1.593993 -0.846221
C  3.054078 0.41949 0.415829
C  -0.752537 1.10318 0.468062
C  3.96176 -0.894488 -1.847567
C  3.708287 1.134358 -0.575703
C  -2.892958 -3.114272 1.131179
C  -1.834991 1.509318 1.249193
C  -0.370962 1.922628 -0.592756
C  4.156155 0.471085 -1.705887
C  -2.52011 2.683815 0.983615
C  -1.048593 3.093985 -0.8760
C  -2.123236 3.469419 -0.08455
C  -2.579053 -4.833477 0.011219
H  -2.362552 -0.760405 -0.226316
H  -1.362411 -1.603964 -1.402899
H  2.775175 -2.516744 1.768998
H  1.877854 -1.069279 2.215687
H  3.148238 -2.65813 -0.968516
H  2.689284 0.942141 1.290133
H  4.315286 -1.405995 -2.731987
H  3.862627 2.19932 -0.470267
H  -3.181055 -2.381068 1.868961
H  0.481915 1.629456 -1.191138
H  -3.355663 2.976039 1.603669
H  -0.739967 3.712868 -1.70665
H  -2.609171 -5.862936 -0.308431
totalener: -2653.51224340 hartree
nucrepener: 2691.11759173 hartree
electener: -5344.62983513 hartree
oneelecener: -8997.20761199 hartree
twoeener: 3652.57777685 hartree
kineticenergy: 2647.23208337 hartree
xcener: -168.233633578795 hartree
chargesum: 0.0000000
charge: -0.072007 -0.079079 -0.068494 -0.035104 0.073232 -0.287110 -0.297403 -0.327777 -0.126242 -0.067437 0.158879 0.071426 -0.190240 -0.191595 0.169436 -0.110351 -0.132491 0.071160 -0.082248 -0.180543 0.075227 -0.079693 -0.100264 0.055119 0.071881 0.150976 0.138956 0.141801 0.115160 0.116680 0.117137 0.124946 0.125869 0.136434 0.132481 0.119564 0.127010 0.134702
qa: -0.0720 -0.0791 -0.0685 -0.0351 0.0732 -0.2871 -0.2974 -0.3278 -0.1262 -0.0674 0.1589 0.0714 -0.1902 -0.1916 0.1694 -0.1104 -0.1325 0.0712 -0.0822 -0.1805 0.0752 -0.0797 -0.1003 0.0551 0.0719 0.1510 0.1390 0.1418 0.1152 0.1167 0.1171 0.1249 0.1259 0.1364 0.1325 0.1196 0.1270 0.1347
va: 1.2556 1.2277 1.2347 2.4213 3.3068 2.9668 2.8480 3.0692 3.9136 3.8310 3.9301 3.5718 4.0401 3.9582 3.7346 3.9919 3.9564 4.0605 3.9667 4.0098 3.9266 3.9984 4.0049 3.9393 4.0404 0.9876 1.0128 0.9984 1.0365 1.0189 1.0175 1.0107 1.0106 1.0165 1.0073 1.0201 1.0103 1.0001
dispcorr: -0.022425040 hartree
energy: -2653.534668435269
dipole: 5.67141 -5.23345 0.43796 -15.42419 15.84235 0.41816 0.64190 -0.61102 0.03088
magnitude: 0.60631 au
magnitude: 1.54113 debye
