program: Orca
programVersion: 4.2.1
elementType: Cl Cl Cl S N N N N C C C C C C C C C C C C C C C C C H H H H H H H H H H H H H
charge: 0
multiplicity: 1
keywords: wb97x-d3
keywords: def2-TZVPP
keywords: def2/J RIJCOSX GRIDX6 NOFINALGRIDX
keywords: grid4 nofinalgrid
keywords: scfconv7
keywords: smallprint printgap noloewdin
keywords: NOSOSCF
formula: C17H13Cl3N4S
InChI: InChI=1/C17H13Cl3N4S/c18-13-3-1-12(2-4-13)9-25-17(8-24-11-21-10-22-24)23-16-6-5-14(19)7-15(16)20/h1-7,10-11H,8-9H2
38 atoms
Cl -2.195687 -1.612372 -2.686583
Cl 4.792644 2.761776 1.91554
Cl -4.427766 2.958149 -0.982285
S  1.556633 -2.932184 -0.353274
N  -1.584468 -1.589623 1.402148
N  0.115036 -0.810393 -0.914126
N  -2.860888 -1.214452 1.27928
N  -1.871044 -0.098346 2.953007
C  -0.991156 -2.537784 0.499404
C  2.709281 -1.878695 -1.282431
C  0.131406 -1.918913 -0.316563
C  3.217544 -0.717697 -0.480308
C  2.912448 0.58852 -0.843014
C  4.017536 -0.927782 0.638711
C  -0.985597 0.042854 -0.922865
C  3.39566 1.663878 -0.113045
C  4.505115 0.134492 1.379828
C  -1.007088 -0.911507 2.406656
C  -2.108241 -0.18566 -1.71562
C  -0.940001 1.218315 -0.176878
C  4.189254 1.429623 0.997214
C  -3.164186 0.709323 -1.747279
C  -1.993886 2.111206 -0.179632
C  -3.103944 1.849673 -0.967608
C  -2.988994 -0.320666 2.227228
H  -1.777904 -2.887263 -0.1691
H  -0.624071 -3.402952 1.055443
H  2.214752 -1.553631 -2.196913
H  3.522235 -2.550724 -1.563521
H  2.281081 0.772521 -1.701695
H  4.262229 -1.937941 0.945106
H  3.153928 2.675984 -0.40673
H  5.127688 -0.040563 2.246179
H  0.026844 -1.040084 2.691189
H  -0.0635 1.415479 0.426044
H  -4.027775 0.506959 -2.364399
H  -1.950406 3.004055 0.427592
H  -3.921842 0.190843 2.40275
totalener: -2653.51035272 hartree
nucrepener: 2771.25730906 hartree
electener: -5424.76766177 hartree
oneelecener: -9158.04153575 hartree
twoeener: 3733.27387397 hartree
kineticenergy: 2647.23073992 hartree
xcener: -168.235324818217 hartree
chargesum: -0.0000000
charge: -0.078016 -0.075499 -0.076695 -0.052872 0.121008 -0.288999 -0.293431 -0.319036 -0.116834 -0.084361 0.132072 0.063948 -0.176530 -0.196678 0.192907 -0.127139 -0.110565 0.024933 -0.017544 -0.208021 0.075860 -0.088851 -0.105541 0.069276 0.065889 0.148104 0.124524 0.120958 0.144012 0.122909 0.112985 0.127552 0.123450 0.146869 0.128674 0.110955 0.124441 0.135287
qa: -0.0780 -0.0755 -0.0767 -0.0529 0.1210 -0.2890 -0.2934 -0.3190 -0.1168 -0.0844 0.1321 0.0639 -0.1765 -0.1967 0.1929 -0.1271 -0.1106 0.0249 -0.0175 -0.2080 0.0759 -0.0889 -0.1055 0.0693 0.0659 0.1481 0.1245 0.1210 0.1440 0.1229 0.1130 0.1276 0.1234 0.1469 0.1287 0.1110 0.1244 0.1353
va: 1.2501 1.2319 1.2261 2.4094 3.2897 2.9675 2.8301 3.0404 3.8808 3.8375 3.9664 3.5675 3.9748 4.0351 3.7522 3.9675 3.9943 4.0832 3.9815 3.9471 3.9410 4.0512 3.9937 3.9071 4.0246 1.0171 1.0091 1.0364 0.9983 1.0158 1.0167 1.0099 1.0110 1.0042 1.0106 1.0216 1.0113 1.0015
dispcorr: -0.025387746 hartree
energy: -2653.535740465409
dipole: 10.09195 -9.10077 0.99117 -9.97501 8.80938 -1.16563 4.32297 -4.69623 -0.37326
magnitude: 1.57494 au
magnitude: 4.00319 debye
