program: Orca
programVersion: 4.2.1
elementType: Cl Cl O N N C C C C C C C C C C C C C C H H H H H H H H H H H H H H
charge: 0
multiplicity: 1
keywords: wb97x-d3
keywords: def2-TZVPP
keywords: def2/J RIJCOSX GRIDX6 NOFINALGRIDX
keywords: grid4 nofinalgrid
keywords: scfconv7
keywords: smallprint printgap noloewdin
keywords: NOSOSCF
formula: C14H14Cl2N2O
InChI: InChI=1/C14H14Cl2N2O/c1-2-7-19-14(9-18-6-5-17-10-18)12-4-3-11(15)8-13(12)16/h2-6,8,10,14H,1,7,9H2
33 atoms
Cl 0.695934 -1.568918 -1.922164
Cl 5.283534 -0.981671 0.769962
O  -0.9354 1.477676 0.81427
N  -2.814724 -0.668348 0.430254
N  -4.646085 -0.66809 -0.802169
C  -0.579323 0.293665 0.153232
C  -1.415141 -0.8390 0.743283
C  0.896311 -0.010943 0.293783
C  1.557185 -0.856366 -0.59273
C  1.641126 0.523325 1.339095
C  -3.721003 0.119382 1.084267
C  -3.414383 -1.095842 -0.702561
C  -0.904428 2.639825 -0.001025
C  2.901322 -1.164321 -0.46394
C  2.98685 0.234944 1.498186
C  3.604519 -0.608911 0.591246
C  -4.846261 0.095558 0.315635
C  -2.158036 2.786139 -0.805185
C  -2.86948 3.903731 -0.86677
H  -0.819001 0.361571 -0.916457
H  -1.090478 -1.800028 0.345643
H  -1.287886 -0.879036 1.825122
H  1.168763 1.186867 2.049667
H  -3.499465 0.603683 2.019307
H  -2.907004 -1.734526 -1.409484
H  -0.780393 3.494067 0.667325
H  -0.026826 2.62018 -0.660569
H  3.38584 -1.820473 -1.172903
H  3.539576 0.666326 2.320472
H  -5.785758 0.586632 0.511739
H  -2.476197 1.924067 -1.385482
H  -3.753828 3.974528 -1.485874
H  -2.594682 4.790787 -0.308218
elementType: Cl O N C H
totalener: -1647.09573874 hartree
nucrepener: 1641.94972148 hartree
electener: -3289.04546022 hartree
oneelecener: -5519.81984518 hartree
twoeener: 2230.77438496 hartree
cpcmener: -0.02662337 hartree
kineticenergy: 1642.59264902 hartree
xcener: -113.417091555182 hartree
chargesum: 0.0000000
charge: -0.083790 -0.086993 -0.383650 -0.016863 -0.400760 0.213677 -0.114240 0.015652 -0.039436 -0.171500 -0.131867 0.029084 0.101545 -0.128992 -0.167682 0.100385 -0.154922 -0.179522 -0.278696 0.117454 0.140148 0.135745 0.146545 0.173035 0.155786 0.106817 0.097076 0.126673 0.147957 0.163401 0.119049 0.131623 0.117260
qa: -0.0838 -0.0870 -0.3837 -0.0169 -0.4008 0.2137 -0.1142 0.0157 -0.0394 -0.1715 -0.1319 0.0291 0.1015 -0.1290 -0.1677 0.1004 -0.1549 -0.1795 -0.2787 0.1175 0.1401 0.1357 0.1465 0.1730 0.1558 0.1068 0.0971 0.1267 0.1480 0.1634 0.1190 0.1316 0.1173
va: 1.2473 1.2167 1.9242 3.2741 3.0942 3.7432 3.7895 3.4813 4.0176 3.9797 3.9051 4.0352 3.8561 4.0470 4.0266 3.8557 4.0351 3.7991 3.9554 0.9925 1.0128 1.0097 1.0239 1.0006 1.0051 0.9989 0.9929 1.0198 1.0051 1.0032 1.0038 1.0018 1.0109
dispcorr: -0.017637571 hartree
energy: -1647.113376308188
dipole: -23.94521 25.63371 1.68850 16.51677 -15.86141 0.65536 3.79233 -2.76763 1.02471
magnitude: 2.08099 au
magnitude: 5.28947 debye
