program: Orca
programVersion: 4.2.1
elementType: Cl Cl O N N C C C C C C C C C C C C C C H H H H H H H H H H H H H H
charge: 0
multiplicity: 1
keywords: wb97x-d3
keywords: def2-TZVPP
keywords: def2/J RIJCOSX GRIDX6 NOFINALGRIDX
keywords: grid4 nofinalgrid
keywords: scfconv7
keywords: smallprint printgap noloewdin
keywords: NOSOSCF
formula: C14H14Cl2N2O
InChI: InChI=1/C14H14Cl2N2O/c1-2-7-19-14(9-18-6-5-17-10-18)12-4-3-11(15)8-13(12)16/h2-6,8,10,14H,1,7,9H2
33 atoms
Cl 0.696044 -1.130803 -2.12808
Cl 5.223972 -0.714357 0.690975
O  -1.122383 1.274954 1.079245
N  -2.868688 -0.911307 0.436461
N  -4.767675 -0.628509 -0.651738
C  -0.711065 0.23356 0.230634
C  -1.443319 -1.052103 0.621951
C  0.780622 0.023078 0.329433
C  1.499991 -0.607212 -0.681955
C  1.485594 0.414968 1.46298
C  -3.770393 -0.436803 1.348282
C  -3.51382 -0.987976 -0.748206
C  -1.872309 2.308795 0.457599
C  2.862993 -0.839421 -0.58936
C  2.847046 0.195036 1.588288
C  3.52413 -0.431842 0.556039
C  -4.937848 -0.281744 0.661058
C  -1.08308 3.055135 -0.569379
C  -1.473426 3.187346 -1.831059
H  -0.95985 0.468356 -0.811791
H  -1.093898 -1.892827 0.022823
H  -1.246021 -1.296857 1.665455
H  0.966452 0.908123 2.272483
H  -3.512967 -0.27014 2.380357
H  -3.022715 -1.329653 -1.646987
H  -2.798002 1.919694 0.015255
H  -2.162243 2.978304 1.270364
H  3.393925 -1.327443 -1.394507
H  3.367677 0.510744 2.481273
H  -5.888117 0.056097 1.042982
H  -0.154466 3.510198 -0.235539
H  -0.896237 3.754273 -2.549868
H  -2.395619 2.742389 -2.19001
elementType: Cl O N C H
totalener: -1647.09570963 hartree
nucrepener: 1652.23554449 hartree
electener: -3299.33125412 hartree
oneelecener: -5540.61268323 hartree
twoeener: 2241.28142911 hartree
cpcmener: -0.02446484 hartree
kineticenergy: 1642.59231228 hartree
xcener: -113.417534273192 hartree
chargesum: 0.0000000
charge: -0.083203 -0.086949 -0.393247 -0.032966 -0.396736 0.215277 -0.120369 0.063558 -0.034502 -0.182053 -0.148157 0.036155 0.095683 -0.126360 -0.157314 0.093208 -0.147449 -0.205682 -0.244417 0.094510 0.140968 0.133837 0.143448 0.176869 0.158699 0.076284 0.106870 0.126157 0.148577 0.163880 0.135438 0.135392 0.114595
qa: -0.0832 -0.0869 -0.3932 -0.0330 -0.3967 0.2153 -0.1204 0.0636 -0.0345 -0.1821 -0.1482 0.0362 0.0957 -0.1264 -0.1573 0.0932 -0.1474 -0.2057 -0.2444 0.0945 0.1410 0.1338 0.1434 0.1769 0.1587 0.0763 0.1069 0.1262 0.1486 0.1639 0.1354 0.1354 0.1146
va: 1.2461 1.2167 1.9153 3.2815 3.0991 3.7365 3.8149 3.5159 4.0129 3.9905 3.9076 4.0248 3.8931 4.0419 4.0160 3.8596 4.0272 3.8136 3.9258 1.0162 1.0131 1.0079 1.0269 0.9957 1.0040 0.9943 0.9923 1.0193 1.0040 1.0032 1.0051 1.0022 1.0093
dispcorr: -0.017864207 hartree
energy: -1647.113573840195
dipole: -23.34701 24.62898 1.28197 12.49651 -12.15198 0.34453 4.13263 -3.14770 0.98493
magnitude: 1.65294 au
magnitude: 4.20145 debye
