program: Orca
programVersion: 4.2.1
elementType: Cl Cl O N N C C C C C C C C C C C C C C H H H H H H H H H H H H H H
charge: 0
multiplicity: 1
keywords: wb97x-d3
keywords: def2-TZVPP
keywords: def2/J RIJCOSX GRIDX6 NOFINALGRIDX
keywords: grid4 nofinalgrid
keywords: scfconv7
keywords: smallprint printgap noloewdin
keywords: NOSOSCF
formula: C14H14Cl2N2O
InChI: InChI=1/C14H14Cl2N2O/c1-2-7-19-14(9-18-6-5-17-10-18)12-4-3-11(15)8-13(12)16/h2-6,8,10,14H,1,7,9H2
33 atoms
Cl -0.330473 -0.54248 -2.110222
Cl 3.965098 -2.240848 0.571073
O  -0.697118 2.54579 0.943721
N  -2.351733 -0.68571 0.670048
N  -3.256713 -2.228774 -0.621294
C  -0.910929 1.293729 0.340006
C  -2.016472 0.627692 1.166145
C  0.33812 0.441291 0.335413
C  0.661857 -0.433612 -0.695234
C  1.182571 0.463629 1.442695
C  -1.729072 -1.864904 0.979592
C  -3.242913 -0.960171 -0.307328
C  0.150903 3.432425 0.224989
C  1.772311 -1.263033 -0.63737
C  2.299926 -0.346729 1.530396
C  2.581027 -1.209211 0.482893
C  -2.305504 -2.802952 0.17748
C  -0.491868 3.996489 -1.002722
C  -0.751025 5.288494 -1.15894
H  -1.2829 1.413108 -0.683534
H  -1.706957 0.540436 2.208067
H  -2.91253 1.247449 1.137745
H  0.963422 1.132514 2.264921
H  -0.961909 -1.93284 1.732743
H  -3.867685 -0.194123 -0.740871
H  0.401276 4.236074 0.918994
H  1.09058 2.932937 -0.040413
H  1.996275 -1.937644 -1.451807
H  2.936247 -0.305534 2.403016
H  -2.088516 -3.85874 0.139334
H  -0.728026 3.309251 -1.809897
H  -1.194881 5.671535 -2.068597
H  -0.525027 6.013877 -0.385776
elementType: Cl O N C H
totalener: -1647.09444363 hartree
nucrepener: 1692.71490682 hartree
electener: -3339.80935045 hartree
oneelecener: -5621.68462186 hartree
twoeener: 2281.87527141 hartree
cpcmener: -0.02882255 hartree
kineticenergy: 1642.59970463 hartree
xcener: -113.421452360666 hartree
chargesum: 0.0000000
charge: -0.079409 -0.085844 -0.394088 -0.046172 -0.388887 0.188135 -0.076752 -0.025608 0.040046 -0.168124 -0.139313 0.018427 0.088069 -0.128918 -0.168428 0.101108 -0.154755 -0.215281 -0.256374 0.116888 0.133188 0.121385 0.145571 0.176594 0.169871 0.111039 0.095642 0.125079 0.149339 0.163491 0.132110 0.134361 0.117610
qa: -0.0794 -0.0858 -0.3941 -0.0462 -0.3889 0.1881 -0.0768 -0.0256 0.0400 -0.1681 -0.1393 0.0184 0.0881 -0.1289 -0.1684 0.1011 -0.1548 -0.2153 -0.2564 0.1169 0.1332 0.1214 0.1456 0.1766 0.1699 0.1110 0.0956 0.1251 0.1493 0.1635 0.1321 0.1344 0.1176
va: 1.2457 1.2179 1.9300 3.3001 3.0975 3.7989 3.8250 3.3689 3.9309 3.9606 3.9015 4.0568 3.8606 4.0578 4.0360 3.8565 4.0531 3.8067 3.9423 1.0016 0.9984 1.0139 1.0210 0.9880 0.9963 0.9990 0.9940 1.0195 1.0028 1.0032 1.0030 1.0006 1.0110
dispcorr: -0.018721727 hartree
energy: -1647.113165354546
dipole: -12.37099 13.34264 0.97165 20.90775 -18.84005 2.06770 5.49989 -4.31673 1.18316
magnitude: 2.57281 au
magnitude: 6.53957 debye
